BDBM50141272 1-[4-Chloro-3-(5-chloro-benzooxazol-2-yl)-phenyl]-3-prop-2-ynyl-urea::CHEMBL35967
SMILES: Clc1ccc2oc(nc2c1)-c1cc(NC(=O)NCC#C)ccc1Cl
InChI Key: InChIKey=BQCDJBXIEHIQOC-UHFFFAOYSA-N
Data: 1 IC50
Activity Spreadsheet -- Enzyme Inhibition Constant Data from BindingDB
Found 1 hit for monomerid = 50141272
Trg + Lig
Ki
nM
ΔG°
kcal/mole
IC50
nM
Kd
nM
EC50/IC50
nM
koff
s-1
kon
M-1s-1
pHTemp
°C
1-acylglycerol-3-phosphate O-acyltransferase beta
(Homo sapiens (Human))
BDBM50141272
(1-[4-Chloro-3-(5-chloro-benzooxazol-2-yl)-phenyl]-...)
Show SMILES Clc1ccc2oc(nc2c1)-c1cc(NC(=O)NCC#C)ccc1Cl
Show InChI InChI=1S/C17H11Cl2N3O2/c1-2-7-20-17(23)21-11-4-5-13(19)12(9-11)16-22-14-8-10(18)3-6-15(14)24-16/h1,3-6,8-9H,7H2,(H2,20,21,23)
Reactome pathway
n/an/a 100n/an/an/an/an/an/a
Cell Therapeutics, Inc.
Curated by ChEMBL
Assay Description
Inhibitory concentration against human lysophosphatidic acid acyltransferase-beta (LPAAT-beta) expressed in Sf9 insect cell membranes
Bioorg Med Chem Lett 14: 1455-9 (2004)
Article DOI: 10.1016/j.bmcl.2004.01.023
BindingDB Entry DOI: 10.7270/Q20Z72Q5