BDBM50142148 5-Chloro-N-(5-chloro-pyridin-2-yl)-2-[4-(2-dimethylamino-4,5-dihydro-imidazol-1-ylmethyl)-benzoylamino]-benzamide::CHEMBL369023
SMILES: CN(C)C1=NCCN1Cc1ccc(cc1)C(=O)Nc1ccc(Cl)cc1C(=O)Nc1ccc(Cl)cn1
InChI Key: InChIKey=WOPOJQYWLMPTOO-UHFFFAOYSA-N
Data: 6 IC50
Activity Spreadsheet -- Enzyme Inhibition Constant Data from BindingDB
Found 6 hits for monomerid = 50142148
Trg + Lig
Ki
nM
ΔG°
kcal/mole
IC50
nM
Kd
nM
EC50/IC50
nM
koff
s-1
kon
M-1s-1
pHTemp
°C
Plasminogen
(Homo sapiens (Human))
BDBM50142148
(5-Chloro-N-(5-chloro-pyridin-2-yl)-2-[4-(2-dimethy...)
Show SMILES CN(C)C1=NCCN1Cc1ccc(cc1)C(=O)Nc1ccc(Cl)cc1C(=O)Nc1ccc(Cl)cn1 |t:3|
Show InChI InChI=1S/C25H24Cl2N6O2/c1-32(2)25-28-11-12-33(25)15-16-3-5-17(6-4-16)23(34)30-21-9-7-18(26)13-20(21)24(35)31-22-10-8-19(27)14-29-22/h3-10,13-14H,11-12,15H2,1-2H3,(H,30,34)(H,29,31,35)
NCI pathway
Reactome pathway
n/an/a>1.10E+4n/an/an/an/an/an/a
Millennium Pharmaceuticals, Inc.
Curated by ChEMBL
Assay Description
Inhibitory activity against plasmin.
Bioorg Med Chem Lett 14: 989-93 (2004)
Article DOI: 10.1016/j.bmcl.2003.11.080
BindingDB Entry DOI: 10.7270/Q2X34WXD
Vitamin K-dependent protein C
(Homo sapiens (Human))
BDBM50142148
(5-Chloro-N-(5-chloro-pyridin-2-yl)-2-[4-(2-dimethy...)
Show SMILES CN(C)C1=NCCN1Cc1ccc(cc1)C(=O)Nc1ccc(Cl)cc1C(=O)Nc1ccc(Cl)cn1 |t:3|
Show InChI InChI=1S/C25H24Cl2N6O2/c1-32(2)25-28-11-12-33(25)15-16-3-5-17(6-4-16)23(34)30-21-9-7-18(26)13-20(21)24(35)31-22-10-8-19(27)14-29-22/h3-10,13-14H,11-12,15H2,1-2H3,(H,30,34)(H,29,31,35)
Reactome pathway
n/an/a>1.10E+4n/an/an/an/an/an/a
Millennium Pharmaceuticals, Inc.
Curated by ChEMBL
Assay Description
Inhibitory activity against activated protein C
Bioorg Med Chem Lett 14: 989-93 (2004)
Article DOI: 10.1016/j.bmcl.2003.11.080
BindingDB Entry DOI: 10.7270/Q2X34WXD
Tissue-type plasminogen activator
(Homo sapiens (Human))
BDBM50142148
(5-Chloro-N-(5-chloro-pyridin-2-yl)-2-[4-(2-dimethy...)
Show SMILES CN(C)C1=NCCN1Cc1ccc(cc1)C(=O)Nc1ccc(Cl)cc1C(=O)Nc1ccc(Cl)cn1 |t:3|
Show InChI InChI=1S/C25H24Cl2N6O2/c1-32(2)25-28-11-12-33(25)15-16-3-5-17(6-4-16)23(34)30-21-9-7-18(26)13-20(21)24(35)31-22-10-8-19(27)14-29-22/h3-10,13-14H,11-12,15H2,1-2H3,(H,30,34)(H,29,31,35)
NCI pathway
Reactome pathway
n/an/a>1.10E+4n/an/an/an/an/an/a
Millennium Pharmaceuticals, Inc.
Curated by ChEMBL
Assay Description
Inhibitory activity against tissue type plasminogen activator.
Bioorg Med Chem Lett 14: 989-93 (2004)
Article DOI: 10.1016/j.bmcl.2003.11.080
BindingDB Entry DOI: 10.7270/Q2X34WXD
Prothrombin
(Homo sapiens (Human))
BDBM50142148
(5-Chloro-N-(5-chloro-pyridin-2-yl)-2-[4-(2-dimethy...)
Show SMILES CN(C)C1=NCCN1Cc1ccc(cc1)C(=O)Nc1ccc(Cl)cc1C(=O)Nc1ccc(Cl)cn1 |t:3|
Show InChI InChI=1S/C25H24Cl2N6O2/c1-32(2)25-28-11-12-33(25)15-16-3-5-17(6-4-16)23(34)30-21-9-7-18(26)13-20(21)24(35)31-22-10-8-19(27)14-29-22/h3-10,13-14H,11-12,15H2,1-2H3,(H,30,34)(H,29,31,35)
n/an/a>1.10E+4n/an/an/an/an/an/a
Millennium Pharmaceuticals, Inc.
Curated by ChEMBL
Assay Description
Inhibitory activity against thrombin.
Bioorg Med Chem Lett 14: 989-93 (2004)
Article DOI: 10.1016/j.bmcl.2003.11.080
BindingDB Entry DOI: 10.7270/Q2X34WXD
Coagulation factor X
(Homo sapiens (Human))
BDBM50142148
(5-Chloro-N-(5-chloro-pyridin-2-yl)-2-[4-(2-dimethy...)
Show SMILES CN(C)C1=NCCN1Cc1ccc(cc1)C(=O)Nc1ccc(Cl)cc1C(=O)Nc1ccc(Cl)cn1 |t:3|
Show InChI InChI=1S/C25H24Cl2N6O2/c1-32(2)25-28-11-12-33(25)15-16-3-5-17(6-4-16)23(34)30-21-9-7-18(26)13-20(21)24(35)31-22-10-8-19(27)14-29-22/h3-10,13-14H,11-12,15H2,1-2H3,(H,30,34)(H,29,31,35)
Reactome pathway
n/an/a 1.30n/an/an/an/an/an/a
Millennium Pharmaceuticals, Inc.
Curated by ChEMBL
Assay Description
In vitro inhibitory activity against coagulation factor X.
Bioorg Med Chem Lett 14: 989-93 (2004)
Article DOI: 10.1016/j.bmcl.2003.11.080
BindingDB Entry DOI: 10.7270/Q2X34WXD
Trypsin-1
(Homo sapiens (Human))
BDBM50142148
(5-Chloro-N-(5-chloro-pyridin-2-yl)-2-[4-(2-dimethy...)
Show SMILES CN(C)C1=NCCN1Cc1ccc(cc1)C(=O)Nc1ccc(Cl)cc1C(=O)Nc1ccc(Cl)cn1 |t:3|
Show InChI InChI=1S/C25H24Cl2N6O2/c1-32(2)25-28-11-12-33(25)15-16-3-5-17(6-4-16)23(34)30-21-9-7-18(26)13-20(21)24(35)31-22-10-8-19(27)14-29-22/h3-10,13-14H,11-12,15H2,1-2H3,(H,30,34)(H,29,31,35)
Reactome pathway
n/an/a>1.10E+4n/an/an/an/an/an/a
Millennium Pharmaceuticals, Inc.
Curated by ChEMBL
Assay Description
Inhibitory activity against trypsin.
Bioorg Med Chem Lett 14: 989-93 (2004)
Article DOI: 10.1016/j.bmcl.2003.11.080
BindingDB Entry DOI: 10.7270/Q2X34WXD