BDBM50142935 CHEMBL3759195
SMILES: Cc1c(CCOCCF)cc(-c2ccc(cc2)S(C)(=O)=O)n1-c1ccc(F)cc1
InChI Key: InChIKey=XOAJBBHBAMPDOU-UHFFFAOYSA-N
Data: 2 IC50
Activity Spreadsheet -- Enzyme Inhibition Constant Data from BindingDB
Found 2 hits for monomerid = 50142935
Trg + Lig
Ki
nM
ΔG°
kcal/mole
IC50
nM
Kd
nM
EC50/IC50
nM
koff
s-1
kon
M-1s-1
pHTemp
°C
Prostaglandin G/H synthase (cyclooxygenase)
(Mus musculus)
BDBM50142935
(CHEMBL3759195)
Show SMILES Cc1c(CCOCCF)cc(-c2ccc(cc2)S(C)(=O)=O)n1-c1ccc(F)cc1
Show InChI InChI=1S/C22H23F2NO3S/c1-16-18(11-13-28-14-12-23)15-22(25(16)20-7-5-19(24)6-8-20)17-3-9-21(10-4-17)29(2,26)27/h3-10,15H,11-14H2,1-2H3
Reactome pathway
n/an/a>1.00E+5n/an/an/an/an/an/a
University of Siena
Curated by ChEMBL
Assay Description
Inhibition of COX-1 in mouse J774 cells assessed as reduction in PGE2 level using arachidonic acid as substrate preincubated for 15 mins followed by ...
Eur J Med Chem 109: 99-106 (2016)
BindingDB Entry DOI: 10.7270/Q2Q2423H
Cyclooxygenase-2 (COX-2)
(Mus musculus (Mouse))
BDBM50142935
(CHEMBL3759195)
Show SMILES Cc1c(CCOCCF)cc(-c2ccc(cc2)S(C)(=O)=O)n1-c1ccc(F)cc1
Show InChI InChI=1S/C22H23F2NO3S/c1-16-18(11-13-28-14-12-23)15-22(25(16)20-7-5-19(24)6-8-20)17-3-9-21(10-4-17)29(2,26)27/h3-10,15H,11-14H2,1-2H3
n/an/a 13n/an/an/an/an/an/a
University of Siena
Curated by ChEMBL
Assay Description
Inhibition of COX-2 in mouse J774 cells assessed as reduction in LPS-induced PGE2 level incubated for 24 hrs by radio immunoassay
Eur J Med Chem 109: 99-106 (2016)
BindingDB Entry DOI: 10.7270/Q2Q2423H