BDBM50143202 CHEMBL3758872
SMILES: CC(C)CC1(O)CCN(CC1)C(=O)Nc1cc(Oc2ccc(F)cc2)cc(Oc2cccc(c2)C(C)(C)C(O)=O)c1
InChI Key: InChIKey=ZFHCHLJDEOWYNZ-UHFFFAOYSA-N
Data: 1 IC50
Activity Spreadsheet -- Enzyme Inhibition Constant Data from BindingDB
Found 1 hit for monomerid = 50143202
Trg + Lig
Ki
nM
ΔG°
kcal/mole
IC50
nM
Kd
nM
EC50/IC50
nM
koff
s-1
kon
M-1s-1
pHTemp
°C
Sphingosine 1-phosphate receptor 2
(Homo sapiens (Human))
BDBM50143202
(CHEMBL3758872)
Show SMILES CC(C)CC1(O)CCN(CC1)C(=O)Nc1cc(Oc2ccc(F)cc2)cc(Oc2cccc(c2)C(C)(C)C(O)=O)c1
Show InChI InChI=1S/C32H37FN2O6/c1-21(2)20-32(39)12-14-35(15-13-32)30(38)34-24-17-27(40-25-10-8-23(33)9-11-25)19-28(18-24)41-26-7-5-6-22(16-26)31(3,4)29(36)37/h5-11,16-19,21,39H,12-15,20H2,1-4H3,(H,34,38)(H,36,37)
NCI pathway
Reactome pathway
n/an/a 8.80n/an/an/an/an/an/a
Ono Pharmaceutical Co.
Curated by ChEMBL
Assay Description
Antagonist activity at S1P2 receptor (unknown origin) expressed in CHO cells assessed as inhibition of S1P-induced increase in intracellular calcium ...
Bioorg Med Chem Lett 26: 1209-13 (2016)
BindingDB Entry DOI: 10.7270/Q2ST7RQ6