BDBM50143204 CHEMBL3760061
SMILES: CC(C)C1(O)CCN(C1)C(=O)Nc1cc(Oc2ccc(F)cc2)cc(Oc2ccc(cc2)C(C)(C)C(O)=O)c1
InChI Key: InChIKey=DJIXMLDGVRLHIK-UHFFFAOYSA-N
Data: 1 IC50
Activity Spreadsheet -- Enzyme Inhibition Constant Data from BindingDB
Found 1 hit for monomerid = 50143204
Trg + Lig
Ki
nM
ΔG°
kcal/mole
IC50
nM
Kd
nM
EC50/IC50
nM
koff
s-1
kon
M-1s-1
pHTemp
°C
Sphingosine 1-phosphate receptor 2
(Homo sapiens (Human))
BDBM50143204
(CHEMBL3760061)
Show SMILES CC(C)C1(O)CCN(C1)C(=O)Nc1cc(Oc2ccc(F)cc2)cc(Oc2ccc(cc2)C(C)(C)C(O)=O)c1
Show InChI InChI=1S/C30H33FN2O6/c1-19(2)30(37)13-14-33(18-30)28(36)32-22-15-25(17-26(16-22)39-24-11-7-21(31)8-12-24)38-23-9-5-20(6-10-23)29(3,4)27(34)35/h5-12,15-17,19,37H,13-14,18H2,1-4H3,(H,32,36)(H,34,35)
NCI pathway
Reactome pathway
n/an/a 29n/an/an/an/an/an/a
Ono Pharmaceutical Co.
Curated by ChEMBL
Assay Description
Antagonist activity at S1P2 receptor (unknown origin) expressed in CHO cells assessed as inhibition of S1P-induced increase in intracellular calcium ...
Bioorg Med Chem Lett 26: 1209-13 (2016)
BindingDB Entry DOI: 10.7270/Q2ST7RQ6