BDBM50143205 CHEMBL3758803
SMILES: CC(C)(C(O)=O)c1ccc(Oc2cc(NC(=O)N3CCC(O)(C3)C3CCCCC3)cc(Oc3ccc(F)cc3)c2)cc1
InChI Key: InChIKey=DBQXXSHEVMMOHU-UHFFFAOYSA-N
Data: 1 IC50
Activity Spreadsheet -- Enzyme Inhibition Constant Data from BindingDB
Found 1 hit for monomerid = 50143205
Trg + Lig
Ki
nM
ΔG°
kcal/mole
IC50
nM
Kd
nM
EC50/IC50
nM
koff
s-1
kon
M-1s-1
pHTemp
°C
Sphingosine 1-phosphate receptor 2
(Homo sapiens (Human))
BDBM50143205
(CHEMBL3758803)
Show SMILES CC(C)(C(O)=O)c1ccc(Oc2cc(NC(=O)N3CCC(O)(C3)C3CCCCC3)cc(Oc3ccc(F)cc3)c2)cc1
Show InChI InChI=1S/C33H37FN2O6/c1-32(2,30(37)38)22-8-12-26(13-9-22)41-28-18-25(19-29(20-28)42-27-14-10-24(34)11-15-27)35-31(39)36-17-16-33(40,21-36)23-6-4-3-5-7-23/h8-15,18-20,23,40H,3-7,16-17,21H2,1-2H3,(H,35,39)(H,37,38)
NCI pathway
Reactome pathway
n/an/a 17n/an/an/an/an/an/a
Ono Pharmaceutical Co.
Curated by ChEMBL
Assay Description
Antagonist activity at S1P2 receptor (unknown origin) expressed in CHO cells assessed as inhibition of S1P-induced increase in intracellular calcium ...
Bioorg Med Chem Lett 26: 1209-13 (2016)
BindingDB Entry DOI: 10.7270/Q2ST7RQ6