BDBM50143293 1-[6-(pyridinium-1-yl)tetradecyl]pyridinium; Dibromide::CHEMBL54580
SMILES: C(CCCCCCC[n+]1ccccc1)CCCCCC[n+]1ccccc1
InChI Key: InChIKey=BAROVFANZMEZJO-UHFFFAOYSA-N
Data: 2 KI  1 IC50
Activity Spreadsheet -- Enzyme Inhibition Constant Data from BindingDB
Found 3 hits for monomerid = 50143293
Trg + Lig
Ki
nM
ΔG°
kcal/mole
IC50
nM
Kd
nM
EC50/IC50
nM
koff
s-1
kon
M-1s-1
pHTemp
°C
Neuronal acetylcholine receptor protein alpha-4/beta-2 subunit
(Rattus norvegicus (Rat))
BDBM50143293
(1-[6-(pyridinium-1-yl)tetradecyl]pyridinium; Dibro...)
Show SMILES C(CCCCCCC[n+]1ccccc1)CCCCCC[n+]1ccccc1
Show InChI InChI=1S/C24H38N2/c1(3-5-7-9-13-19-25-21-15-11-16-22-25)2-4-6-8-10-14-20-26-23-17-12-18-24-26/h11-12,15-18,21-24H,1-10,13-14,19-20H2/q+2
9.15E+3n/an/an/an/an/an/an/an/a
University of Kentucky
Curated by ChEMBL
Assay Description
Inhibitory activity of the compound against nAChR mediated nicotine-evoked [3H]-DA overflow using rat striatal slices
Bioorg Med Chem Lett 14: 1869-74 (2004)
Article DOI: 10.1016/j.bmcl.2003.10.074
BindingDB Entry DOI: 10.7270/Q21N80JP
Neuronal acetylcholine receptor
(Rattus norvegicus (Rat))
BDBM50143293
(1-[6-(pyridinium-1-yl)tetradecyl]pyridinium; Dibro...)
Show SMILES C(CCCCCCC[n+]1ccccc1)CCCCCC[n+]1ccccc1
Show InChI InChI=1S/C24H38N2/c1(3-5-7-9-13-19-25-21-15-11-16-22-25)2-4-6-8-10-14-20-26-23-17-12-18-24-26/h11-12,15-18,21-24H,1-10,13-14,19-20H2/q+2
Reactome pathway
3.30E+4n/an/an/an/an/an/an/an/a
University of Kentucky
Curated by ChEMBL
Assay Description
Inhibition of [3H]-MLA binding to Nicotinic acetylcholine receptor alpha7 in rat brain
Bioorg Med Chem Lett 14: 1869-74 (2004)
Article DOI: 10.1016/j.bmcl.2003.10.074
BindingDB Entry DOI: 10.7270/Q21N80JP
Neuronal acetylcholine receptor protein alpha-4/beta-2 subunit
(Rattus norvegicus (Rat))
BDBM50143293
(1-[6-(pyridinium-1-yl)tetradecyl]pyridinium; Dibro...)
Show SMILES C(CCCCCCC[n+]1ccccc1)CCCCCC[n+]1ccccc1
Show InChI InChI=1S/C24H38N2/c1(3-5-7-9-13-19-25-21-15-11-16-22-25)2-4-6-8-10-14-20-26-23-17-12-18-24-26/h11-12,15-18,21-24H,1-10,13-14,19-20H2/q+2
n/an/a 1.00E+3n/an/an/an/an/an/a
University of Kentucky
Curated by ChEMBL
Assay Description
Inhibition of [3H]-nicotine binding to Nicotinic acetylcholine receptor alpha4-beta2 in rat brain
Bioorg Med Chem Lett 14: 1869-74 (2004)
Article DOI: 10.1016/j.bmcl.2003.10.074
BindingDB Entry DOI: 10.7270/Q21N80JP