BDBM50143294 1-Icosyl-pyridinium; bromide::1-icosylpyridinium bromide::CHEMBL54851
SMILES: CCCCCCCCCCCCCCCCCCCC[n+]1ccccc1
InChI Key: InChIKey=UJGFWFXKZOQLBM-UHFFFAOYSA-N
Data: 1 IC50
Activity Spreadsheet -- Enzyme Inhibition Constant Data from BindingDB
Found 1 hit for monomerid = 50143294
Trg + Lig
Ki
nM
ΔG°
kcal/mole
IC50
nM
Kd
nM
EC50/IC50
nM
koff
s-1
kon
M-1s-1
pHTemp
°C
Neuronal acetylcholine receptor protein alpha-4/beta-2 subunit
(Rattus norvegicus (Rat))
BDBM50143294
(1-Icosyl-pyridinium; bromide | 1-icosylpyridinium ...)
Show SMILES CCCCCCCCCCCCCCCCCCCC[n+]1ccccc1
Show InChI InChI=1S/C25H46N/c1-2-3-4-5-6-7-8-9-10-11-12-13-14-15-16-17-18-20-23-26-24-21-19-22-25-26/h19,21-22,24-25H,2-18,20,23H2,1H3/q+1
n/an/a 120n/an/an/an/an/an/a
University of Kentucky
Curated by ChEMBL
Assay Description
Inhibition of [3H]-nicotine binding to Nicotinic acetylcholine receptor alpha4-beta2 in rat brain
Bioorg Med Chem Lett 14: 1869-74 (2004)
Article DOI: 10.1016/j.bmcl.2003.10.074
BindingDB Entry DOI: 10.7270/Q21N80JP