BDBM50143302 (S)-1-dodecyl-3-(1-methylpyrrolidin-2-yl)pyridinium iodide::1-Dodecyl-3-((S)-1-methyl-pyrrolidin-2-yl)-pyridinium; iodide::CHEMBL55606
SMILES: CCCCCCCCCCCC[n+]1cccc(c1)[C@@H]1CCCN1C
InChI Key: InChIKey=NAVBJWWCUOXXQB-QFIPXVFZSA-N
Data: 3 KI  1 IC50
Activity Spreadsheet -- Enzyme Inhibition Constant Data from BindingDB
Found 4 hits for monomerid = 50143302
Trg + Lig
Ki
nM
ΔG°
kcal/mole
IC50
nM
Kd
nM
EC50/IC50
nM
koff
s-1
kon
M-1s-1
pHTemp
°C
Neuronal acetylcholine receptor Alpha-4/Beta-2
(Homo sapiens (Human))
BDBM50143302
((S)-1-dodecyl-3-(1-methylpyrrolidin-2-yl)pyridiniu...)
Show SMILES CCCCCCCCCCCC[n+]1cccc(c1)[C@@H]1CCCN1C
Show InChI InChI=1S/C22H39N2/c1-3-4-5-6-7-8-9-10-11-12-18-24-19-13-15-21(20-24)22-16-14-17-23(22)2/h13,15,19-20,22H,3-12,14,16-18H2,1-2H3/q+1/t22-/m0/s1
NCI pathway
Reactome pathway
0.140n/an/an/an/an/an/an/an/a
Universit£ degli Studi di Milano
Curated by ChEMBL
Assay Description
Binding affinity to alpha4beta2 nAChR (unknown origin)
Eur J Med Chem 101: 367-83 (2015)
BindingDB Entry DOI: 10.7270/Q25M67H8
Neuronal acetylcholine receptor protein alpha-4/beta-2 subunit
(Rattus norvegicus (Rat))
BDBM50143302
((S)-1-dodecyl-3-(1-methylpyrrolidin-2-yl)pyridiniu...)
Show SMILES CCCCCCCCCCCC[n+]1cccc(c1)[C@@H]1CCCN1C
Show InChI InChI=1S/C22H39N2/c1-3-4-5-6-7-8-9-10-11-12-18-24-19-13-15-21(20-24)22-16-14-17-23(22)2/h13,15,19-20,22H,3-12,14,16-18H2,1-2H3/q+1/t22-/m0/s1
140n/an/an/an/an/an/an/an/a
University of Kentucky
Curated by ChEMBL
Assay Description
Inhibitory activity of the compound against nAChR mediated nicotine-evoked [3H]-DA overflow using rat striatal slices
Bioorg Med Chem Lett 14: 1869-74 (2004)
Article DOI: 10.1016/j.bmcl.2003.10.074
BindingDB Entry DOI: 10.7270/Q21N80JP
Neuronal acetylcholine receptor
(Rattus norvegicus (Rat))
BDBM50143302
((S)-1-dodecyl-3-(1-methylpyrrolidin-2-yl)pyridiniu...)
Show SMILES CCCCCCCCCCCC[n+]1cccc(c1)[C@@H]1CCCN1C
Show InChI InChI=1S/C22H39N2/c1-3-4-5-6-7-8-9-10-11-12-18-24-19-13-15-21(20-24)22-16-14-17-23(22)2/h13,15,19-20,22H,3-12,14,16-18H2,1-2H3/q+1/t22-/m0/s1
Reactome pathway
8.30E+4n/an/an/an/an/an/an/an/a
Universit£ degli Studi di Milano
Curated by ChEMBL
Assay Description
Displacement of [125I]alpha-bungarotoxin from alpha7 nAChR in Sprague-Dawley rat hippocampus membrane homogenates by gamma counting
Eur J Med Chem 101: 367-83 (2015)
BindingDB Entry DOI: 10.7270/Q25M67H8
Neuronal acetylcholine receptor protein alpha-4/beta-2 subunit
(Rattus norvegicus (Rat))
BDBM50143302
((S)-1-dodecyl-3-(1-methylpyrrolidin-2-yl)pyridiniu...)
Show SMILES CCCCCCCCCCCC[n+]1cccc(c1)[C@@H]1CCCN1C
Show InChI InChI=1S/C22H39N2/c1-3-4-5-6-7-8-9-10-11-12-18-24-19-13-15-21(20-24)22-16-14-17-23(22)2/h13,15,19-20,22H,3-12,14,16-18H2,1-2H3/q+1/t22-/m0/s1
n/an/a 9n/an/an/an/an/an/a
University of Kentucky
Curated by ChEMBL
Assay Description
Inhibitory activity of the compound against nAChR mediated nicotine-evoked [3H]-DA overflow using rat striatal slices
Bioorg Med Chem Lett 14: 1869-74 (2004)
Article DOI: 10.1016/j.bmcl.2003.10.074
BindingDB Entry DOI: 10.7270/Q21N80JP