BDBM50143345 CHEMBL57487::N*4*-Acridin-9-yl-N*1*,N*1*-diethyl-hexane-1,4-diamine
SMILES: CCC(CCCN(CC)CC)Nc1c2ccccc2nc2ccccc12
InChI Key: InChIKey=QUTAMUNYXXDDMV-UHFFFAOYSA-N
Data: 1 IC50
Activity Spreadsheet -- Enzyme Inhibition Constant Data from BindingDB
Found 1 hit for monomerid = 50143345
Trg + Lig
Ki
nM
ΔG°
kcal/mole
IC50
nM
Kd
nM
EC50/IC50
nM
koff
s-1
kon
M-1s-1
pHTemp
°C
Voltage-dependent calcium channel subunit alpha-2/delta-1
(Homo sapiens (Human))
BDBM50143345
(CHEMBL57487 | N*4*-Acridin-9-yl-N*1*,N*1*-diethyl-...)
Show SMILES CCC(CCCN(CC)CC)Nc1c2ccccc2nc2ccccc12
Show InChI InChI=1S/C23H31N3/c1-4-18(12-11-17-26(5-2)6-3)24-23-19-13-7-9-15-21(19)25-22-16-10-8-14-20(22)23/h7-10,13-16,18H,4-6,11-12,17H2,1-3H3,(H,24,25)
n/an/a 38n/an/an/an/an/an/a
Merck Research Laboratories
Curated by ChEMBL
Assay Description
Binding affinity towards alpha2-delta subunit of a voltage gated calcium channel using [3H]-gabapentin in human brain membrane (A710 membrane)
Bioorg Med Chem Lett 14: 1913-6 (2004)
Article DOI: 10.1016/j.bmcl.2004.01.087
BindingDB Entry DOI: 10.7270/Q2HQ3ZBQ