BDBM50143561 (E)-N-[(S)-1-(3,4-Dihydro-2H-benzo[1,4]oxazin-6-yl)-ethyl]-3-(2-fluoro-phenyl)-acrylamide::CHEMBL368956
SMILES: C[C@H](NC(=O)\C=C\c1ccccc1F)c1ccc2OCCNc2c1
InChI Key: InChIKey=KJKISBSTHVUMEV-XOVSCCBYSA-N
Data: 1 EC50
Activity Spreadsheet -- Enzyme Inhibition Constant Data from BindingDB
Found 1 hit for monomerid = 50143561
Trg + Lig
Ki
nM
ΔG°
kcal/mole
IC50
nM
Kd
nM
EC50/IC50
nM
koff
s-1
kon
M-1s-1
pHTemp
°C
Voltage-gated potassium channel subunit Kv7.2
(Mus musculus)
BDBM50143561
((E)-N-[(S)-1-(3,4-Dihydro-2H-benzo[1,4]oxazin-6-yl...)
Show SMILES C[C@H](NC(=O)\C=C\c1ccccc1F)c1ccc2OCCNc2c1
Show InChI InChI=1S/C19H19FN2O2/c1-13(15-6-8-18-17(12-15)21-10-11-24-18)22-19(23)9-7-14-4-2-3-5-16(14)20/h2-9,12-13,21H,10-11H2,1H3,(H,22,23)/b9-7+/t13-/m0/s1
Reactome pathway
n/an/an/an/a 2.00E+3n/an/an/an/a
Bristol-Myers Squibb Pharmaceutical Research Institute
Curated by ChEMBL
Assay Description
Whole-cell patch-clamp on recombinant mouse KCNQ2 channels expressed in HEK 293 cells at -40 mV
Bioorg Med Chem Lett 14: 1991-5 (2004)
Article DOI: 10.1016/j.bmcl.2004.01.069
BindingDB Entry DOI: 10.7270/Q2MG7NZ3