null
SMILES: FC(F)(F)S(=O)(=O)Nc1ccc2c(\C=C\c3ccccc3)cccc2c1
InChI Key: InChIKey=VGMFGRCGQUJRPG-MDZDMXLPSA-N
Activity Spreadsheet -- Enzyme Inhibition Constant Data from BindingDB
Found 1 hit for monomerid = 50143625
Trg + Lig
Ki
nM
ΔG°
kcal/mole
IC50
nM
Kd
nM
EC50/IC50
nM
koff
s-1
kon
M-1s-1
pHTemp
°C
Capsid scaffolding protein
(Human cytomegalovirus (strain AD169) (HHV-5) (Huma...)
BDBM50143625
(C,C,C-Trifluoro-N-(5-styryl-naphthalen-2-yl)-metha...)
Show SMILES FC(F)(F)S(=O)(=O)Nc1ccc2c(\C=C\c3ccccc3)cccc2c1
Show InChI InChI=1S/C19H14F3NO2S/c20-19(21,22)26(24,25)23-17-11-12-18-15(7-4-8-16(18)13-17)10-9-14-5-2-1-3-6-14/h1-13,23H/b10-9+
n/an/a 7.5n/an/an/an/an/an/a
Wyeth Research
Curated by ChEMBL
Assay Description
Inhibitory concentration against HCMV protease.
J Med Chem 47: 1893-9 (2004)
Article DOI: 10.1021/jm030540h
BindingDB Entry DOI: 10.7270/Q2765DRK