BDBM50143633 4-chloro-N-[({5-[(1E)-7-chloroquinolin-2-yl)vinyl]-2-naphthyl}amino)carbonyl]benzenesulfonamide::CHEMBL54930
SMILES: Clc1ccc(cc1)S(=O)(=O)NC(=O)Nc1ccc2c(\C=C\c3ccc4ccc(Cl)cc4n3)cccc2c1
InChI Key: InChIKey=QOFXZNBRDPPMAB-BJMVGYQFSA-N
Data: 1 IC50
Activity Spreadsheet -- Enzyme Inhibition Constant Data from BindingDB
Found 1 hit for monomerid = 50143633
Trg + Lig
Ki
nM
ΔG°
kcal/mole
IC50
nM
Kd
nM
EC50/IC50
nM
koff
s-1
kon
M-1s-1
pHTemp
°C
Human herpes virus 5 capsid protein P40
(Human cytomegalovirus (strain AD169) (HHV-5) (Huma...)
BDBM50143633
(4-chloro-N-[({5-[(1E)-7-chloroquinolin-2-yl)vinyl]...)
Show SMILES Clc1ccc(cc1)S(=O)(=O)NC(=O)Nc1ccc2c(\C=C\c3ccc4ccc(Cl)cc4n3)cccc2c1
Show InChI InChI=1S/C28H19Cl2N3O3S/c29-21-8-13-25(14-9-21)37(35,36)33-28(34)32-24-12-15-26-18(2-1-3-20(26)16-24)5-10-23-11-6-19-4-7-22(30)17-27(19)31-23/h1-17H,(H2,32,33,34)/b10-5+
n/an/a 4.70n/an/an/an/an/an/a
Wyeth Research
Curated by ChEMBL
Assay Description
Inhibitory concentration against HCMV protease.
J Med Chem 47: 1893-9 (2004)
Article DOI: 10.1021/jm030540h
BindingDB Entry DOI: 10.7270/Q2765DRK