BDBM50143740 (4-(4-(benzyl(phenyl)amino)piperidin-1-yl)-4-methylpiperidin-1-yl)(2,6-dimethylphenyl)methanone::CHEMBL301454::[4-(Benzyl-phenyl-amino)-4'-methyl-[1,4']bipiperidinyl-1'-yl]-(2,6-dimethyl-phenyl)-methanone
SMILES: Cc1cccc(C)c1C(=O)N1CCC(C)(CC1)N1CCC(CC1)N(Cc1ccccc1)c1ccccc1
InChI Key: InChIKey=JBRPUKJNMGIQRP-UHFFFAOYSA-N
Data: 7 IC50
Activity Spreadsheet -- Enzyme Inhibition Constant Data from BindingDB
Found 7 hits for monomerid = 50143740
Trg + Lig
Ki
nM
ΔG°
kcal/mole
IC50
nM
Kd
nM
EC50/IC50
nM
koff
s-1
kon
M-1s-1
pHTemp
°C
C-C chemokine receptor type 5
(Homo sapiens (Human))
BDBM50143740
((4-(4-(benzyl(phenyl)amino)piperidin-1-yl)-4-methy...)
Show SMILES Cc1cccc(C)c1C(=O)N1CCC(C)(CC1)N1CCC(CC1)N(Cc1ccccc1)c1ccccc1
Show InChI InChI=1S/C33H41N3O/c1-26-11-10-12-27(2)31(26)32(37)34-23-19-33(3,20-24-34)35-21-17-30(18-22-35)36(29-15-8-5-9-16-29)25-28-13-6-4-7-14-28/h4-16,30H,17-25H2,1-3H3
n/an/a 1.40n/an/an/an/an/an/a
Novartis Institutes for BioMedical Research
Curated by ChEMBL
Assay Description
Antagonistic activity against human C-C chemokine receptor type 5.
J Med Chem 47: 1939-55 (2004)
Article DOI: 10.1021/jm031046g
BindingDB Entry DOI: 10.7270/Q2V12478
C-C chemokine receptor type 5
(Homo sapiens (Human))
BDBM50143740
((4-(4-(benzyl(phenyl)amino)piperidin-1-yl)-4-methy...)
Show SMILES Cc1cccc(C)c1C(=O)N1CCC(C)(CC1)N1CCC(CC1)N(Cc1ccccc1)c1ccccc1
Show InChI InChI=1S/C33H41N3O/c1-26-11-10-12-27(2)31(26)32(37)34-23-19-33(3,20-24-34)35-21-17-30(18-22-35)36(29-15-8-5-9-16-29)25-28-13-6-4-7-14-28/h4-16,30H,17-25H2,1-3H3
n/an/a 14.4n/an/an/an/an/an/a
Novartis Institutes for BioMedical Research
Curated by ChEMBL
Assay Description
Migration of compound was evaluated in cellmigration assay with C-C chemokine receptor type 5-transfected L1.2 cells or activated human peripheral bl...
J Med Chem 47: 1939-55 (2004)
Article DOI: 10.1021/jm031046g
BindingDB Entry DOI: 10.7270/Q2V12478
C-C chemokine receptor type 5
(Homo sapiens (Human))
BDBM50143740
((4-(4-(benzyl(phenyl)amino)piperidin-1-yl)-4-methy...)
Show SMILES Cc1cccc(C)c1C(=O)N1CCC(C)(CC1)N1CCC(CC1)N(Cc1ccccc1)c1ccccc1
Show InChI InChI=1S/C33H41N3O/c1-26-11-10-12-27(2)31(26)32(37)34-23-19-33(3,20-24-34)35-21-17-30(18-22-35)36(29-15-8-5-9-16-29)25-28-13-6-4-7-14-28/h4-16,30H,17-25H2,1-3H3
n/an/a 3n/an/an/an/an/an/a
Novartis Institutes for BioMedical Research
Curated by ChEMBL
Assay Description
Antagonistic activity against monkey C-C chemokine receptor type 5.
J Med Chem 47: 1939-55 (2004)
Article DOI: 10.1021/jm031046g
BindingDB Entry DOI: 10.7270/Q2V12478
Potassium voltage-gated channel subfamily H member 2
(Homo sapiens (Human))
BDBM50143740
((4-(4-(benzyl(phenyl)amino)piperidin-1-yl)-4-methy...)
Show SMILES Cc1cccc(C)c1C(=O)N1CCC(C)(CC1)N1CCC(CC1)N(Cc1ccccc1)c1ccccc1
Show InChI InChI=1S/C33H41N3O/c1-26-11-10-12-27(2)31(26)32(37)34-23-19-33(3,20-24-34)35-21-17-30(18-22-35)36(29-15-8-5-9-16-29)25-28-13-6-4-7-14-28/h4-16,30H,17-25H2,1-3H3
Reactome pathway
n/an/a 670n/an/an/an/an/an/a
Novartis Institutes for BioMedical Research
Curated by ChEMBL
Assay Description
Displacement of [3H]dofetilide from human ERG expressed in HEK293 cell membranes
Bioorg Med Chem Lett 18: 2000-5 (2008)
Article DOI: 10.1016/j.bmcl.2008.01.108
BindingDB Entry DOI: 10.7270/Q2NC6229
C-C chemokine receptor type 5
(Macaca fascicularis)
BDBM50143740
((4-(4-(benzyl(phenyl)amino)piperidin-1-yl)-4-methy...)
Show SMILES Cc1cccc(C)c1C(=O)N1CCC(C)(CC1)N1CCC(CC1)N(Cc1ccccc1)c1ccccc1
Show InChI InChI=1S/C33H41N3O/c1-26-11-10-12-27(2)31(26)32(37)34-23-19-33(3,20-24-34)35-21-17-30(18-22-35)36(29-15-8-5-9-16-29)25-28-13-6-4-7-14-28/h4-16,30H,17-25H2,1-3H3
n/an/a 3n/an/an/an/an/an/a
Novartis Institutes for BioMedical Research
Curated by ChEMBL
Assay Description
Displacement of radiolabeled MIP-1alpha from cynomolgus monkey CCR5 expressed in CHO cells
Bioorg Med Chem Lett 18: 2000-5 (2008)
Article DOI: 10.1016/j.bmcl.2008.01.108
BindingDB Entry DOI: 10.7270/Q2NC6229
C-C chemokine receptor type 5
(Homo sapiens (Human))
BDBM50143740
((4-(4-(benzyl(phenyl)amino)piperidin-1-yl)-4-methy...)
Show SMILES Cc1cccc(C)c1C(=O)N1CCC(C)(CC1)N1CCC(CC1)N(Cc1ccccc1)c1ccccc1
Show InChI InChI=1S/C33H41N3O/c1-26-11-10-12-27(2)31(26)32(37)34-23-19-33(3,20-24-34)35-21-17-30(18-22-35)36(29-15-8-5-9-16-29)25-28-13-6-4-7-14-28/h4-16,30H,17-25H2,1-3H3
n/an/a 1.40n/an/an/an/an/an/a
Novartis Institutes for BioMedical Research
Curated by ChEMBL
Assay Description
Displacement of [125I]RANTES from human CCR5 expressed in CHO cells
Bioorg Med Chem Lett 18: 2000-5 (2008)
Article DOI: 10.1016/j.bmcl.2008.01.108
BindingDB Entry DOI: 10.7270/Q2NC6229
C-C chemokine receptor type 5
(Homo sapiens (Human))
BDBM50143740
((4-(4-(benzyl(phenyl)amino)piperidin-1-yl)-4-methy...)
Show SMILES Cc1cccc(C)c1C(=O)N1CCC(C)(CC1)N1CCC(CC1)N(Cc1ccccc1)c1ccccc1
Show InChI InChI=1S/C33H41N3O/c1-26-11-10-12-27(2)31(26)32(37)34-23-19-33(3,20-24-34)35-21-17-30(18-22-35)36(29-15-8-5-9-16-29)25-28-13-6-4-7-14-28/h4-16,30H,17-25H2,1-3H3
n/an/a 12.2n/an/an/an/an/an/a
Novartis Institutes for BioMedical Research
Curated by ChEMBL
Assay Description
Rises in intracellular [Ca2+] levels by using [Ca2+] sensitive Fluo4 dye in C-C chemokine receptor type 5-transfected CHO cells.
J Med Chem 47: 1939-55 (2004)
Article DOI: 10.1021/jm031046g
BindingDB Entry DOI: 10.7270/Q2V12478