BDBM50143761 CHEMBL61466::[4-(4-Chloro-phenylamino)-4'-methyl-[1,4']bipiperidinyl-1'-yl]-(2,6-dimethyl-phenyl)-methanone
SMILES: Cc1cccc(C)c1C(=O)N1CCC(C)(CC1)N1CCC(CC1)Nc1ccc(Cl)cc1
InChI Key: InChIKey=AQZFFMQBFOQLGR-UHFFFAOYSA-N
Data: 3 IC50
Activity Spreadsheet -- Enzyme Inhibition Constant Data from BindingDB
Found 3 hits for monomerid = 50143761
Trg + Lig
Ki
nM
ΔG°
kcal/mole
IC50
nM
Kd
nM
EC50/IC50
nM
koff
s-1
kon
M-1s-1
pHTemp
°C
C-C chemokine receptor type 5
(Homo sapiens (Human))
BDBM50143761
(CHEMBL61466 | [4-(4-Chloro-phenylamino)-4'-methyl-...)
Show SMILES Cc1cccc(C)c1C(=O)N1CCC(C)(CC1)N1CCC(CC1)Nc1ccc(Cl)cc1
Show InChI InChI=1S/C26H34ClN3O/c1-19-5-4-6-20(2)24(19)25(31)29-17-13-26(3,14-18-29)30-15-11-23(12-16-30)28-22-9-7-21(27)8-10-22/h4-10,23,28H,11-18H2,1-3H3
n/an/a 2.40n/an/an/an/an/an/a
Novartis Institutes for BioMedical Research
Curated by ChEMBL
Assay Description
Antagonistic activity against human C-C chemokine receptor type 5.
J Med Chem 47: 1939-55 (2004)
Article DOI: 10.1021/jm031046g
BindingDB Entry DOI: 10.7270/Q2V12478
C-C chemokine receptor type 5
(Homo sapiens (Human))
BDBM50143761
(CHEMBL61466 | [4-(4-Chloro-phenylamino)-4'-methyl-...)
Show SMILES Cc1cccc(C)c1C(=O)N1CCC(C)(CC1)N1CCC(CC1)Nc1ccc(Cl)cc1
Show InChI InChI=1S/C26H34ClN3O/c1-19-5-4-6-20(2)24(19)25(31)29-17-13-26(3,14-18-29)30-15-11-23(12-16-30)28-22-9-7-21(27)8-10-22/h4-10,23,28H,11-18H2,1-3H3
n/an/a 2n/an/an/an/an/an/a
Novartis Institutes for BioMedical Research
Curated by ChEMBL
Assay Description
Antagonistic activity against monkey C-C chemokine receptor type 5.
J Med Chem 47: 1939-55 (2004)
Article DOI: 10.1021/jm031046g
BindingDB Entry DOI: 10.7270/Q2V12478
C-C chemokine receptor type 5
(Homo sapiens (Human))
BDBM50143761
(CHEMBL61466 | [4-(4-Chloro-phenylamino)-4'-methyl-...)
Show SMILES Cc1cccc(C)c1C(=O)N1CCC(C)(CC1)N1CCC(CC1)Nc1ccc(Cl)cc1
Show InChI InChI=1S/C26H34ClN3O/c1-19-5-4-6-20(2)24(19)25(31)29-17-13-26(3,14-18-29)30-15-11-23(12-16-30)28-22-9-7-21(27)8-10-22/h4-10,23,28H,11-18H2,1-3H3
n/an/a 25.7n/an/an/an/an/an/a
Novartis Institutes for BioMedical Research
Curated by ChEMBL
Assay Description
Rises in intracellular [Ca2+] levels by using [Ca2+] sensitive Fluo4 dye in C-C chemokine receptor type 5-transfected CHO cells.
J Med Chem 47: 1939-55 (2004)
Article DOI: 10.1021/jm031046g
BindingDB Entry DOI: 10.7270/Q2V12478