BDBM50143823 (E)-3-[5-Methyl-4-(5,5,8,8-tetramethyl-5,6,7,8-tetrahydro-naphthalen-2-ylmethyl)-furan-2-yl]-acrylic acid::CHEMBL62258
SMILES: Cc1oc(\C=C\C(O)=O)cc1Cc1ccc2c(c1)C(C)(C)CCC2(C)C
InChI Key: InChIKey=PCLGZAGPVGBVBQ-VQHVLOKHSA-N
Data: 2 KI  4 EC50
Activity Spreadsheet -- Enzyme Inhibition Constant Data from BindingDB
Found 6 hits for monomerid = 50143823
Trg + Lig
Ki
nM
ΔG°
kcal/mole
IC50
nM
Kd
nM
EC50/IC50
nM
koff
s-1
kon
M-1s-1
pHTemp
°C
Retinoic acid receptor RXR-alpha
(Homo sapiens (Human))
BDBM50143823
((E)-3-[5-Methyl-4-(5,5,8,8-tetramethyl-5,6,7,8-tet...)
Show SMILES Cc1oc(\C=C\C(O)=O)cc1Cc1ccc2c(c1)C(C)(C)CCC2(C)C
Show InChI InChI=1S/C23H28O3/c1-15-17(14-18(26-15)7-9-21(24)25)12-16-6-8-19-20(13-16)23(4,5)11-10-22(19,2)3/h6-9,13-14H,10-12H2,1-5H3,(H,24,25)/b9-7+
NCI pathway
Reactome pathway
158n/an/an/an/an/an/an/an/a
GlaxoSmithKline Research and Development
Curated by ChEMBL
Assay Description
Binding affinity for retinoid X receptor alpha (RXRalpha), using 9-cis-[3H]-retinoic acid
J Med Chem 47: 2010-29 (2004)
Article DOI: 10.1021/jm030565g
BindingDB Entry DOI: 10.7270/Q2KH0MRC
Retinoid X receptor gamma/retinoic acid receptor alpha
(Homo sapiens (Human))
BDBM50143823
((E)-3-[5-Methyl-4-(5,5,8,8-tetramethyl-5,6,7,8-tet...)
Show SMILES Cc1oc(\C=C\C(O)=O)cc1Cc1ccc2c(c1)C(C)(C)CCC2(C)C
Show InChI InChI=1S/C23H28O3/c1-15-17(14-18(26-15)7-9-21(24)25)12-16-6-8-19-20(13-16)23(4,5)11-10-22(19,2)3/h6-9,13-14H,10-12H2,1-5H3,(H,24,25)/b9-7+
NCI pathway
Reactome pathway
>1.00E+3n/an/an/an/an/an/an/an/a
GlaxoSmithKline Research and Development
Curated by ChEMBL
Assay Description
Binding affinity for retinoic acid receptor alpha (RARalpha), using 9-cis-[3H]-retinoic acid
J Med Chem 47: 2010-29 (2004)
Article DOI: 10.1021/jm030565g
BindingDB Entry DOI: 10.7270/Q2KH0MRC
Retinoid X receptor gamma/retinoic acid receptor alpha
(Homo sapiens (Human))
BDBM50143823
((E)-3-[5-Methyl-4-(5,5,8,8-tetramethyl-5,6,7,8-tet...)
Show SMILES Cc1oc(\C=C\C(O)=O)cc1Cc1ccc2c(c1)C(C)(C)CCC2(C)C
Show InChI InChI=1S/C23H28O3/c1-15-17(14-18(26-15)7-9-21(24)25)12-16-6-8-19-20(13-16)23(4,5)11-10-22(19,2)3/h6-9,13-14H,10-12H2,1-5H3,(H,24,25)/b9-7+
NCI pathway
Reactome pathway
n/an/an/an/a>1.00E+3n/an/an/an/a
GlaxoSmithKline Research and Development
Curated by ChEMBL
Assay Description
Effective concentration for retinoic acid receptor alpha induced lipogenesis in C3H10T1/2 clone 8 fibroblast cells
J Med Chem 47: 2010-29 (2004)
Article DOI: 10.1021/jm030565g
BindingDB Entry DOI: 10.7270/Q2KH0MRC
Retinoid X receptor gamma/retinoic acid receptor alpha
(Homo sapiens (Human))
BDBM50143823
((E)-3-[5-Methyl-4-(5,5,8,8-tetramethyl-5,6,7,8-tet...)
Show SMILES Cc1oc(\C=C\C(O)=O)cc1Cc1ccc2c(c1)C(C)(C)CCC2(C)C
Show InChI InChI=1S/C23H28O3/c1-15-17(14-18(26-15)7-9-21(24)25)12-16-6-8-19-20(13-16)23(4,5)11-10-22(19,2)3/h6-9,13-14H,10-12H2,1-5H3,(H,24,25)/b9-7+
NCI pathway
Reactome pathway
n/an/an/an/a>1.00E+4n/an/an/an/a
GlaxoSmithKline Research and Development
Curated by ChEMBL
Assay Description
Effective concentration for Retinoic acid receptor alpha activity in CV-1 cells
J Med Chem 47: 2010-29 (2004)
Article DOI: 10.1021/jm030565g
BindingDB Entry DOI: 10.7270/Q2KH0MRC
Retinoic acid receptor RXR-alpha
(Homo sapiens (Human))
BDBM50143823
((E)-3-[5-Methyl-4-(5,5,8,8-tetramethyl-5,6,7,8-tet...)
Show SMILES Cc1oc(\C=C\C(O)=O)cc1Cc1ccc2c(c1)C(C)(C)CCC2(C)C
Show InChI InChI=1S/C23H28O3/c1-15-17(14-18(26-15)7-9-21(24)25)12-16-6-8-19-20(13-16)23(4,5)11-10-22(19,2)3/h6-9,13-14H,10-12H2,1-5H3,(H,24,25)/b9-7+
NCI pathway
Reactome pathway
n/an/an/an/a 106n/an/an/an/a
GlaxoSmithKline Research and Development
Curated by ChEMBL
Assay Description
Effective concentration for Retinoid X receptor alpha activity in CV-1 cells
J Med Chem 47: 2010-29 (2004)
Article DOI: 10.1021/jm030565g
BindingDB Entry DOI: 10.7270/Q2KH0MRC
Retinoic acid receptor RXR-alpha
(Homo sapiens (Human))
BDBM50143823
((E)-3-[5-Methyl-4-(5,5,8,8-tetramethyl-5,6,7,8-tet...)
Show SMILES Cc1oc(\C=C\C(O)=O)cc1Cc1ccc2c(c1)C(C)(C)CCC2(C)C
Show InChI InChI=1S/C23H28O3/c1-15-17(14-18(26-15)7-9-21(24)25)12-16-6-8-19-20(13-16)23(4,5)11-10-22(19,2)3/h6-9,13-14H,10-12H2,1-5H3,(H,24,25)/b9-7+
NCI pathway
Reactome pathway
n/an/an/an/a 1.00E+3n/an/an/an/a
GlaxoSmithKline Research and Development
Curated by ChEMBL
Assay Description
Effective concentration for lipogenesis induced by retinoid X receptor alpha in C3H10T1/2 clone 8 fibroblast cells
J Med Chem 47: 2010-29 (2004)
Article DOI: 10.1021/jm030565g
BindingDB Entry DOI: 10.7270/Q2KH0MRC