BDBM50143888 CHEMBL3758281
SMILES: ONC(=O)CCCCCC(=O)N\N=C\c1ccc(cc1)-c1ccncc1
InChI Key: InChIKey=DZJZQNLBLZSWDQ-KGENOOAVSA-N
Data: 3 IC50
Activity Spreadsheet -- Enzyme Inhibition Constant Data from BindingDB
Found 3 hits for monomerid = 50143888
Trg + Lig
Ki
nM
ΔG°
kcal/mole
IC50
nM
Kd
nM
EC50/IC50
nM
koff
s-1
kon
M-1s-1
pHTemp
°C
Histone deacetylase 1
(Homo sapiens (Human))
BDBM50143888
(CHEMBL3758281)
Show SMILES ONC(=O)CCCCCC(=O)N\N=C\c1ccc(cc1)-c1ccncc1
Show InChI InChI=1S/C19H22N4O3/c24-18(4-2-1-3-5-19(25)23-26)22-21-14-15-6-8-16(9-7-15)17-10-12-20-13-11-17/h6-14,26H,1-5H2,(H,22,24)(H,23,25)/b21-14+
NCI pathway
Reactome pathway
n/an/a 3.10n/an/an/an/an/an/a
Massachusetts General Hospital
Curated by ChEMBL
Assay Description
Inhibition of human recombinant HDAC1 using acetyllysine tripeptide coupled with 7-amino-4-methylcoumarin as substrate by fluorescence assay
Bioorg Med Chem Lett 26: 1265-71 (2016)
BindingDB Entry DOI: 10.7270/Q2H99714
Histone deacetylase 3
(Homo sapiens (Human))
BDBM50143888
(CHEMBL3758281)
Show SMILES ONC(=O)CCCCCC(=O)N\N=C\c1ccc(cc1)-c1ccncc1
Show InChI InChI=1S/C19H22N4O3/c24-18(4-2-1-3-5-19(25)23-26)22-21-14-15-6-8-16(9-7-15)17-10-12-20-13-11-17/h6-14,26H,1-5H2,(H,22,24)(H,23,25)/b21-14+
NCI pathway
Reactome pathway
n/an/a 1.80n/an/an/an/an/an/a
Massachusetts General Hospital
Curated by ChEMBL
Assay Description
Inhibition of human recombinant HDAC3 using acetyllysine tripeptide coupled with 7-amino-4-methylcoumarin as substrate by fluorescence assay
Bioorg Med Chem Lett 26: 1265-71 (2016)
BindingDB Entry DOI: 10.7270/Q2H99714
Histone deacetylase 2
(Homo sapiens (Human))
BDBM50143888
(CHEMBL3758281)
Show SMILES ONC(=O)CCCCCC(=O)N\N=C\c1ccc(cc1)-c1ccncc1
Show InChI InChI=1S/C19H22N4O3/c24-18(4-2-1-3-5-19(25)23-26)22-21-14-15-6-8-16(9-7-15)17-10-12-20-13-11-17/h6-14,26H,1-5H2,(H,22,24)(H,23,25)/b21-14+
NCI pathway
Reactome pathway
n/an/a 14n/an/an/an/an/an/a
Massachusetts General Hospital
Curated by ChEMBL
Assay Description
Inhibition of human recombinant HDAC2 using acetyllysine tripeptide coupled with 7-amino-4-methylcoumarin as substrate by fluorescence assay
Bioorg Med Chem Lett 26: 1265-71 (2016)
BindingDB Entry DOI: 10.7270/Q2H99714