BDBM50143956 2-{4-[3-(2,6-Dimethyl-phenoxy)-2-hydroxy-propyl]-piperazin-1-yl}-N-(4-methoxy-benzyl)-2-p-tolyl-acetamide::CHEMBL64767
SMILES: COc1ccc(CNC(=O)C(N2CCN(CC(O)COc3c(C)cccc3C)CC2)c2ccc(C)cc2)cc1
InChI Key: InChIKey=QEJAZMZAGVBHNZ-UHFFFAOYSA-N
Data: 1 KI  1 IC50
Activity Spreadsheet -- Enzyme Inhibition Constant Data from BindingDB
Found 2 hits for monomerid = 50143956
Trg + Lig
Ki
nM
ΔG°
kcal/mole
IC50
nM
Kd
nM
EC50/IC50
nM
koff
s-1
kon
M-1s-1
pHTemp
°C
Cytochrome P450 2D6
(Homo sapiens (Human))
BDBM50143956
(2-{4-[3-(2,6-Dimethyl-phenoxy)-2-hydroxy-propyl]-p...)
Show SMILES COc1ccc(CNC(=O)C(N2CCN(CC(O)COc3c(C)cccc3C)CC2)c2ccc(C)cc2)cc1
Show InChI InChI=1S/C32H41N3O4/c1-23-8-12-27(13-9-23)30(32(37)33-20-26-10-14-29(38-4)15-11-26)35-18-16-34(17-19-35)21-28(36)22-39-31-24(2)6-5-7-25(31)3/h5-15,28,30,36H,16-22H2,1-4H3,(H,33,37)
3.00E+3n/an/an/an/an/an/an/an/a
ArQule Inc
Curated by ChEMBL
Assay Description
Predictive competitive inhibition of cytochrome P450 2D6 was determined in silico
Bioorg Med Chem Lett 14: 2025-30 (2004)
Article DOI: 10.1016/j.bmcl.2004.02.078
BindingDB Entry DOI: 10.7270/Q22J6B8R
Sodium channel protein type I I alpha subunit
(Rattus norvegicus)
BDBM50143956
(2-{4-[3-(2,6-Dimethyl-phenoxy)-2-hydroxy-propyl]-p...)
Show SMILES COc1ccc(CNC(=O)C(N2CCN(CC(O)COc3c(C)cccc3C)CC2)c2ccc(C)cc2)cc1
Show InChI InChI=1S/C32H41N3O4/c1-23-8-12-27(13-9-23)30(32(37)33-20-26-10-14-29(38-4)15-11-26)35-18-16-34(17-19-35)21-28(36)22-39-31-24(2)6-5-7-25(31)3/h5-15,28,30,36H,16-22H2,1-4H3,(H,33,37)
n/an/a 351n/an/an/an/an/an/a
ArQule Inc
Curated by ChEMBL
Assay Description
In vitro inhibition of [3H]-batrachotoxin binding to neurotoxin site 2 of sodium (Na+) channel in rat cerebral cortex membrane
Bioorg Med Chem Lett 14: 2025-30 (2004)
Article DOI: 10.1016/j.bmcl.2004.02.078
BindingDB Entry DOI: 10.7270/Q22J6B8R