BDBM50144132 2-{4-(5-Chloro-1H-indole-2-sulfonyl)-1-[4-(1-methyl-4,5-dihydro-1H-imidazol-2-yl)-benzoyl]-piperazin-2-yl}-N,N-dimethyl-acetamide::CHEMBL66030
SMILES: CN(C)C(=O)CC1CN(CCN1C(=O)c1ccc(cc1)C1=NCCN1C)S(=O)(=O)c1cc2cc(Cl)ccc2[nH]1
InChI Key: InChIKey=FMVPCAMMFIDRDJ-UHFFFAOYSA-N
Data: 1 IC50
Activity Spreadsheet -- Enzyme Inhibition Constant Data from BindingDB
Found 1 hit for monomerid = 50144132
Trg + Lig
Ki
nM
ΔG°
kcal/mole
IC50
nM
Kd
nM
EC50/IC50
nM
koff
s-1
kon
M-1s-1
pHTemp
°C
Coagulation factor X
(Homo sapiens (Human))
BDBM50144132
(2-{4-(5-Chloro-1H-indole-2-sulfonyl)-1-[4-(1-methy...)
Show SMILES CN(C)C(=O)CC1CN(CCN1C(=O)c1ccc(cc1)C1=NCCN1C)S(=O)(=O)c1cc2cc(Cl)ccc2[nH]1 |t:22|
Show InChI InChI=1S/C27H31ClN6O4S/c1-31(2)25(35)16-22-17-33(39(37,38)24-15-20-14-21(28)8-9-23(20)30-24)12-13-34(22)27(36)19-6-4-18(5-7-19)26-29-10-11-32(26)3/h4-9,14-15,22,30H,10-13,16-17H2,1-3H3
Reactome pathway
n/an/a 10n/an/an/an/an/an/a
Millennium Pharmaceuticals, Inc.
Curated by ChEMBL
Assay Description
In vitro inhibitory activity against Coagulation factor X was determined
Bioorg Med Chem Lett 14: 2073-8 (2004)
Article DOI: 10.1016/j.bmcl.2004.02.049
BindingDB Entry DOI: 10.7270/Q2P84B98