BDBM50144234 4-((R)-(S)-8-Aza-bicyclo[3.2.1]oct-3-yl-phenyl-amino)-N,N-diethyl-benzamide::CHEMBL304196
SMILES: CCN(CC)C(=O)c1ccc(cc1)N(C1C[C@@H]2CC[C@H](C1)N2)c1ccccc1
InChI Key: InChIKey=MYTSDSWMJSRDRF-DETIRCLXSA-N
Data: 2 KI  1 EC50
Activity Spreadsheet -- Enzyme Inhibition Constant Data from BindingDB
Found 3 hits for monomerid = 50144234
Trg + Lig
Ki
nM
ΔG°
kcal/mole
IC50
nM
Kd
nM
EC50/IC50
nM
koff
s-1
kon
M-1s-1
pHTemp
°C
Delta-type opioid receptor
(Homo sapiens (Human))
BDBM50144234
(4-((R)-(S)-8-Aza-bicyclo[3.2.1]oct-3-yl-phenyl-ami...)
Show SMILES CCN(CC)C(=O)c1ccc(cc1)N(C1C[C@@H]2CC[C@H](C1)N2)c1ccccc1
Show InChI InChI=1S/C24H31N3O/c1-3-26(4-2)24(28)18-10-14-22(15-11-18)27(21-8-6-5-7-9-21)23-16-19-12-13-20(17-23)25-19/h5-11,14-15,19-20,23,25H,3-4,12-13,16-17H2,1-2H3/t19-,20+,23?
Reactome pathway
0.300n/an/an/an/an/an/an/an/a
Johnson and Johnson Pharmaceutical Research and Development
Curated by ChEMBL
Assay Description
Effective concentration against stimulation of [35S]-GTP-gammaS, binding in CHO cells transfected with the human opioid receptor delta 1
Bioorg Med Chem Lett 14: 2109-12 (2004)
Article DOI: 10.1016/j.bmcl.2004.02.051
BindingDB Entry DOI: 10.7270/Q25B01X4
Mu-type opioid receptor
(Homo sapiens (Human))
BDBM50144234
(4-((R)-(S)-8-Aza-bicyclo[3.2.1]oct-3-yl-phenyl-ami...)
Show SMILES CCN(CC)C(=O)c1ccc(cc1)N(C1C[C@@H]2CC[C@H](C1)N2)c1ccccc1
Show InChI InChI=1S/C24H31N3O/c1-3-26(4-2)24(28)18-10-14-22(15-11-18)27(21-8-6-5-7-9-21)23-16-19-12-13-20(17-23)25-19/h5-11,14-15,19-20,23,25H,3-4,12-13,16-17H2,1-2H3/t19-,20+,23?
NCI pathway
Reactome pathway
5.04E+3n/an/an/an/an/an/an/an/a
Johnson and Johnson Pharmaceutical Research and Development
Curated by ChEMBL
Assay Description
Binding affinity for mu opioid receptor
Bioorg Med Chem Lett 14: 2109-12 (2004)
Article DOI: 10.1016/j.bmcl.2004.02.051
BindingDB Entry DOI: 10.7270/Q25B01X4
Delta-type opioid receptor
(Homo sapiens (Human))
BDBM50144234
(4-((R)-(S)-8-Aza-bicyclo[3.2.1]oct-3-yl-phenyl-ami...)
Show SMILES CCN(CC)C(=O)c1ccc(cc1)N(C1C[C@@H]2CC[C@H](C1)N2)c1ccccc1
Show InChI InChI=1S/C24H31N3O/c1-3-26(4-2)24(28)18-10-14-22(15-11-18)27(21-8-6-5-7-9-21)23-16-19-12-13-20(17-23)25-19/h5-11,14-15,19-20,23,25H,3-4,12-13,16-17H2,1-2H3/t19-,20+,23?
Reactome pathway
n/an/an/an/a 12n/an/an/an/a
Johnson and Johnson Pharmaceutical Research and Development
Curated by ChEMBL
Assay Description
Effective concentration against stimulation of [35S]-GTP-gammaS, binding in CHO cells transfected with the human opioid receptor delta 1
Bioorg Med Chem Lett 14: 2109-12 (2004)
Article DOI: 10.1016/j.bmcl.2004.02.051
BindingDB Entry DOI: 10.7270/Q25B01X4