BDBM50144374 CHEMBL3759576
SMILES: Cc1cc(Cl)c2CCc3cc(sc3-c2c1)C(O)=O
InChI Key: InChIKey=CLBIWTVNSHLFDF-UHFFFAOYSA-N
Data: 2 EC50
Activity Spreadsheet -- Enzyme Inhibition Constant Data from BindingDB
Found 2 hits for monomerid = 50144374
Trg + Lig
Ki
nM
ΔG°
kcal/mole
IC50
nM
Kd
nM
EC50/IC50
nM
koff
s-1
kon
M-1s-1
pHTemp
°C
Palmitoleoyl-protein carboxylesterase NOTUM
(Homo sapiens (Human))
BDBM50144374
(CHEMBL3759576)
Show SMILES Cc1cc(Cl)c2CCc3cc(sc3-c2c1)C(O)=O
Show InChI InChI=1S/C14H11ClO2S/c1-7-4-10-9(11(15)5-7)3-2-8-6-12(14(16)17)18-13(8)10/h4-6H,2-3H2,1H3,(H,16,17)
n/an/an/an/a 36n/an/an/an/a
Lexicon Pharmaceuticals
Curated by ChEMBL
Assay Description
Inhibition of human notum pectinacetylesterase expressed in 293F cells by TCF/LEF CellSensor assay
Bioorg Med Chem Lett 26: 1184-7 (2016)
BindingDB Entry DOI: 10.7270/Q2QV3PBN
Palmitoleoyl-protein carboxylesterase NOTUM
(Mus musculus)
BDBM50144374
(CHEMBL3759576)
Show SMILES Cc1cc(Cl)c2CCc3cc(sc3-c2c1)C(O)=O
Show InChI InChI=1S/C14H11ClO2S/c1-7-4-10-9(11(15)5-7)3-2-8-6-12(14(16)17)18-13(8)10/h4-6H,2-3H2,1H3,(H,16,17)
n/an/an/an/a 19n/an/an/an/a
Lexicon Pharmaceuticals
Curated by ChEMBL
Assay Description
Inhibition of mouse notum pectinacetylesterase expressed in 293F cells by TCF/LEF CellSensor assay
Bioorg Med Chem Lett 26: 1184-7 (2016)
BindingDB Entry DOI: 10.7270/Q2QV3PBN