BDBM50144542 CHEMBL3758532
SMILES: OC(=O)c1cc2C[S+]([O-])c3ccccc3-c2s1
InChI Key: InChIKey=PMOFXYJOFKKKPH-UHFFFAOYSA-N
Data: 2 EC50
Activity Spreadsheet -- Enzyme Inhibition Constant Data from BindingDB
Found 2 hits for monomerid = 50144542
Trg + Lig
Ki
nM
ΔG°
kcal/mole
IC50
nM
Kd
nM
EC50/IC50
nM
koff
s-1
kon
M-1s-1
pHTemp
°C
Palmitoleoyl-protein carboxylesterase NOTUM
(Homo sapiens (Human))
BDBM50144542
(CHEMBL3758532)
Show SMILES OC(=O)c1cc2C[S+]([O-])c3ccccc3-c2s1
Show InChI InChI=1S/C12H8O3S2/c13-12(14)9-5-7-6-17(15)10-4-2-1-3-8(10)11(7)16-9/h1-5H,6H2,(H,13,14)
n/an/an/an/a 2.31E+3n/an/an/an/a
Lexicon Pharmaceuticals
Curated by ChEMBL
Assay Description
Inhibition of human notum pectinacetylesterase expressed in 293F cells by TCF/LEF CellSensor assay
Bioorg Med Chem Lett 26: 1184-7 (2016)
BindingDB Entry DOI: 10.7270/Q2QV3PBN
Palmitoleoyl-protein carboxylesterase NOTUM
(Mus musculus)
BDBM50144542
(CHEMBL3758532)
Show SMILES OC(=O)c1cc2C[S+]([O-])c3ccccc3-c2s1
Show InChI InChI=1S/C12H8O3S2/c13-12(14)9-5-7-6-17(15)10-4-2-1-3-8(10)11(7)16-9/h1-5H,6H2,(H,13,14)
n/an/an/an/a 1.19E+3n/an/an/an/a
Lexicon Pharmaceuticals
Curated by ChEMBL
Assay Description
Inhibition of mouse notum pectinacetylesterase expressed in 293F cells by TCF/LEF CellSensor assay
Bioorg Med Chem Lett 26: 1184-7 (2016)
BindingDB Entry DOI: 10.7270/Q2QV3PBN