BDBM50144626 CHEMBL305662::[4-((2S,5S)-5-{4-[(R)-(4-Chloro-phenyl)-phenyl-methyl]-piperazin-1-ylmethyl}-tetrahydro-furan-2-yl)-but-3-ynyl]-N-hydroxyurea
SMILES: NC(=O)N(O)CCC#C[C@@H]1CC[C@@H](CN2CCN(CC2)[C@H](c2ccccc2)c2ccc(Cl)cc2)O1
InChI Key: InChIKey=ZBUWQTCXTJMDCD-UODIDJSMSA-N
Data: 1 KI  1 IC50
Activity Spreadsheet -- Enzyme Inhibition Constant Data from BindingDB
Found 2 hits for monomerid = 50144626
Trg + Lig
Ki
nM
ΔG°
kcal/mole
IC50
nM
Kd
nM
EC50/IC50
nM
koff
s-1
kon
M-1s-1
pHTemp
°C
Histamine H1 receptor
(Homo sapiens (Human))
BDBM50144626
(CHEMBL305662 | [4-((2S,5S)-5-{4-[(R)-(4-Chloro-phe...)
Show SMILES NC(=O)N(O)CCC#C[C@@H]1CC[C@@H](CN2CCN(CC2)[C@H](c2ccccc2)c2ccc(Cl)cc2)O1
Show InChI InChI=1S/C27H33ClN4O3/c28-23-11-9-22(10-12-23)26(21-6-2-1-3-7-21)31-18-16-30(17-19-31)20-25-14-13-24(35-25)8-4-5-15-32(34)27(29)33/h1-3,6-7,9-12,24-26,34H,5,13-20H2,(H2,29,33)/t24-,25+,26-/m1/s1
Reactome pathway
50n/an/an/an/an/an/an/an/a
UCB Research
Curated by ChEMBL
Assay Description
In vitro binding affinity towards histamine H1 receptor expressed in CHO-K1 cells
Bioorg Med Chem Lett 14: 2265-8 (2004)
Article DOI: 10.1016/j.bmcl.2004.02.005
BindingDB Entry DOI: 10.7270/Q2BV7G2P
Arachidonate 5-lipoxygenase
(Homo sapiens (Human))
BDBM50144626
(CHEMBL305662 | [4-((2S,5S)-5-{4-[(R)-(4-Chloro-phe...)
Show SMILES NC(=O)N(O)CCC#C[C@@H]1CC[C@@H](CN2CCN(CC2)[C@H](c2ccccc2)c2ccc(Cl)cc2)O1
Show InChI InChI=1S/C27H33ClN4O3/c28-23-11-9-22(10-12-23)26(21-6-2-1-3-7-21)31-18-16-30(17-19-31)20-25-14-13-24(35-25)8-4-5-15-32(34)27(29)33/h1-3,6-7,9-12,24-26,34H,5,13-20H2,(H2,29,33)/t24-,25+,26-/m1/s1
Reactome pathway
n/an/a 310n/an/an/an/an/an/a
UCB Research
Curated by ChEMBL
Assay Description
In vitro inhibitory activity against 5-lipoxygenase in a human whole blood assay
Bioorg Med Chem Lett 14: 2265-8 (2004)
Article DOI: 10.1016/j.bmcl.2004.02.005
BindingDB Entry DOI: 10.7270/Q2BV7G2P