BDBM50144665 2,2-Dimethyl-propionic acid 2-(3,4-dimethyl-benzyl)-3-[3-(2-chloro-4-methanesulfonylamino-benzyl)-thioureido-N-hydroxy]-propyl ester::CHEMBL72562
SMILES: Cc1ccc(CC(COC(=O)C(C)(C)C)CN(O)C(=S)NCc2ccc(NS(C)(=O)=O)c(F)c2)cc1C
InChI Key: InChIKey=MPSDSTPGUUFZSG-UHFFFAOYSA-N
Data: 1 KI  1 IC50
Activity Spreadsheet -- Enzyme Inhibition Constant Data from BindingDB
Found 2 hits for monomerid = 50144665
Trg + Lig
Ki
nM
ΔG°
kcal/mole
IC50
nM
Kd
nM
EC50/IC50
nM
koff
s-1
kon
M-1s-1
pHTemp
°C
Vanilloid receptor
(Rattus norvegicus (rat))
BDBM50144665
(2,2-Dimethyl-propionic acid 2-(3,4-dimethyl-benzyl...)
Show SMILES Cc1ccc(CC(COC(=O)C(C)(C)C)CN(O)C(=S)NCc2ccc(NS(C)(=O)=O)c(F)c2)cc1C
Show InChI InChI=1S/C26H36FN3O5S2/c1-17-7-8-19(11-18(17)2)12-21(16-35-24(31)26(3,4)5)15-30(32)25(36)28-14-20-9-10-23(22(27)13-20)29-37(6,33)34/h7-11,13,21,29,32H,12,14-16H2,1-6H3,(H,28,36)
Reactome pathway
212n/an/an/an/an/an/an/an/a
Seoul National University
Curated by ChEMBL
Assay Description
Binding affinity towards rat vanilloid receptor subtype 1 expressed in CHO cells by [3H]-RTX displacement.
Bioorg Med Chem Lett 14: 2291-7 (2004)
Article DOI: 10.1016/j.bmcl.2004.02.002
BindingDB Entry DOI: 10.7270/Q2TT4QCG
Vanilloid receptor
(Rattus norvegicus (rat))
BDBM50144665
(2,2-Dimethyl-propionic acid 2-(3,4-dimethyl-benzyl...)
Show SMILES Cc1ccc(CC(COC(=O)C(C)(C)C)CN(O)C(=S)NCc2ccc(NS(C)(=O)=O)c(F)c2)cc1C
Show InChI InChI=1S/C26H36FN3O5S2/c1-17-7-8-19(11-18(17)2)12-21(16-35-24(31)26(3,4)5)15-30(32)25(36)28-14-20-9-10-23(22(27)13-20)29-37(6,33)34/h7-11,13,21,29,32H,12,14-16H2,1-6H3,(H,28,36)
Reactome pathway
n/an/a 94n/an/an/an/an/an/a
Seoul National University
Curated by ChEMBL
Assay Description
Binding affinity towards rat vanilloid receptor subtype 1 expressed in CHO cells by [3H]-RTX displacement.
Bioorg Med Chem Lett 14: 2291-7 (2004)
Article DOI: 10.1016/j.bmcl.2004.02.002
BindingDB Entry DOI: 10.7270/Q2TT4QCG