BDBM50144671 2,2-Dimethyl-propionic acid 2-(3,4-dimethyl-benzyl)-3-[2-(4-methanesulfonylamino-phenyl)-acetylamino]-propyl ester::CHEMBL308507
SMILES: Cc1ccc(CC(CNC(=O)Cc2ccc(NS(C)(=O)=O)cc2)COC(=O)C(C)(C)C)cc1C
InChI Key: InChIKey=PAULSDWCWJSSBP-UHFFFAOYSA-N
Data: 1 KI  1 IC50
Activity Spreadsheet -- Enzyme Inhibition Constant Data from BindingDB
Found 2 hits for monomerid = 50144671
Trg + Lig
Ki
nM
ΔG°
kcal/mole
IC50
nM
Kd
nM
EC50/IC50
nM
koff
s-1
kon
M-1s-1
pHTemp
°C
Vanilloid receptor
(Rattus norvegicus (rat))
BDBM50144671
(2,2-Dimethyl-propionic acid 2-(3,4-dimethyl-benzyl...)
Show SMILES Cc1ccc(CC(CNC(=O)Cc2ccc(NS(C)(=O)=O)cc2)COC(=O)C(C)(C)C)cc1C
Show InChI InChI=1S/C26H36N2O5S/c1-18-7-8-21(13-19(18)2)14-22(17-33-25(30)26(3,4)5)16-27-24(29)15-20-9-11-23(12-10-20)28-34(6,31)32/h7-13,22,28H,14-17H2,1-6H3,(H,27,29)
Reactome pathway
500n/an/an/an/an/an/an/an/a
Seoul National University
Curated by ChEMBL
Assay Description
In vitro antagonist effect against 50 nM capsaicin-induced 45 [Ca2+] influx in vanilloid recptor expressing CHO cells
Bioorg Med Chem Lett 14: 2291-7 (2004)
Article DOI: 10.1016/j.bmcl.2004.02.002
BindingDB Entry DOI: 10.7270/Q2TT4QCG
Vanilloid receptor
(Rattus norvegicus (rat))
BDBM50144671
(2,2-Dimethyl-propionic acid 2-(3,4-dimethyl-benzyl...)
Show SMILES Cc1ccc(CC(CNC(=O)Cc2ccc(NS(C)(=O)=O)cc2)COC(=O)C(C)(C)C)cc1C
Show InChI InChI=1S/C26H36N2O5S/c1-18-7-8-21(13-19(18)2)14-22(17-33-25(30)26(3,4)5)16-27-24(29)15-20-9-11-23(12-10-20)28-34(6,31)32/h7-13,22,28H,14-17H2,1-6H3,(H,27,29)
Reactome pathway
n/an/a 460n/an/an/an/an/an/a
Seoul National University
Curated by ChEMBL
Assay Description
In vitro antagonist effect against 50 nM capsaicin-induced 45 [Ca2+] influx in vanilloid recptor expressing CHO cells
Bioorg Med Chem Lett 14: 2291-7 (2004)
Article DOI: 10.1016/j.bmcl.2004.02.002
BindingDB Entry DOI: 10.7270/Q2TT4QCG