BDBM50144719 6-(5-Bromo-2-ethoxy-phenyl)-N*4*-(4-dihydroxyboron-phenyl)-pyrimidine-2,4-diamine::CHEMBL74932
SMILES: CCOc1ccc(Br)cc1-c1cc(Nc2ccc(cc2)B(O)O)nc(N)n1
InChI Key: InChIKey=WHSLPOPSIWHYPQ-UHFFFAOYSA-N
Data: 1 IC50
Activity Spreadsheet -- Enzyme Inhibition Constant Data from BindingDB
Found 1 hit for monomerid = 50144719
Trg + Lig
Ki
nM
ΔG°
kcal/mole
IC50
nM
Kd
nM
EC50/IC50
nM
koff
s-1
kon
M-1s-1
pHTemp
°C
1-acylglycerol-3-phosphate O-acyltransferase beta
(Homo sapiens (Human))
BDBM50144719
(6-(5-Bromo-2-ethoxy-phenyl)-N*4*-(4-dihydroxyboron...)
Show SMILES CCOc1ccc(Br)cc1-c1cc(Nc2ccc(cc2)B(O)O)nc(N)n1
Show InChI InChI=1S/C18H18BBrN4O3/c1-2-27-16-8-5-12(20)9-14(16)15-10-17(24-18(21)23-15)22-13-6-3-11(4-7-13)19(25)26/h3-10,25-26H,2H2,1H3,(H3,21,22,23,24)
Reactome pathway
n/an/a 91n/an/an/an/an/an/a
Cell Therapeutics, Inc
Curated by ChEMBL
Assay Description
Inhibitory activity against Lysophosphatidic acid acyltransferase-beta expressed in Sf9 insect cell membranes
Bioorg Med Chem Lett 14: 2303-8 (2004)
Article DOI: 10.1016/j.bmcl.2004.01.104
BindingDB Entry DOI: 10.7270/Q2Q23ZPH