null
SMILES: COc1c(O)c(C(=O)\C=C\c2cc(Br)cs2)c(OC)c2ccoc12
InChI Key: InChIKey=VASOZZCCIPIYAT-ONEGZZNKSA-N
Activity Spreadsheet -- Enzyme Inhibition Constant Data from BindingDB
Found 1 hit for monomerid = 50145047
Trg + Lig
Ki
nM
ΔG°
kcal/mole
IC50
nM
Kd
nM
EC50/IC50
nM
koff
s-1
kon
M-1s-1
pHTemp
°C
Potassium voltage-gated channel subfamily A member 3
(Homo sapiens (Human))
BDBM50145047
((E)-3-(4-Bromo-thiophen-2-yl)-1-(6-hydroxy-4,7-dim...)
Show SMILES COc1c(O)c(C(=O)\C=C\c2cc(Br)cs2)c(OC)c2ccoc12
Show InChI InChI=1S/C17H13BrO5S/c1-21-15-11-5-6-23-16(11)17(22-2)14(20)13(15)12(19)4-3-10-7-9(18)8-24-10/h3-8,20H,1-2H3/b4-3+
Reactome pathway
n/an/an/a 800n/an/an/an/an/a
Institute of Medical Research Biotechnology Centre
Curated by ChEMBL
Assay Description
Dissociation constant for the blockage of voltage-gated potassium channel subunit Kv1.3 in human lymphocytes
J Med Chem 47: 2326-36 (2004)
Article DOI: 10.1021/jm030523s
BindingDB Entry DOI: 10.7270/Q28W3CRM