null
SMILES: CC1(C)C(=O)Nc2ccc(cc12)S(=O)(=O)NNc1ccc(Br)cc1
InChI Key: InChIKey=JXDVZJCIYBVVMX-UHFFFAOYSA-N
Activity Spreadsheet -- Enzyme Inhibition Constant Data from BindingDB
Found 2 hits for monomerid = 50145160
Trg + Lig
Ki
nM
ΔG°
kcal/mole
IC50
nM
Kd
nM
EC50/IC50
nM
koff
s-1
kon
M-1s-1
pHTemp
°C
Indoleamine 2,3-dioxygenase 1
(Homo sapiens (Human))
BDBM50145160
(CHEMBL3764846)
Show SMILES CC1(C)C(=O)Nc2ccc(cc12)S(=O)(=O)NNc1ccc(Br)cc1
Show InChI InChI=1S/C16H16BrN3O3S/c1-16(2)13-9-12(7-8-14(13)18-15(16)21)24(22,23)20-19-11-5-3-10(17)4-6-11/h3-9,19-20H,1-2H3,(H,18,21)
Reactome pathway
n/an/a 70n/an/an/an/an/an/a
National Health Research Institutes
Curated by ChEMBL
Assay Description
Inhibition of human Indoleamine 2,3-dioxygenase using L-tryptophan as substrate by emission fluorescence analysis
J Med Chem 59: 419-30 (2016)
BindingDB Entry DOI: 10.7270/Q2FF3V69
Indoleamine 2,3-dioxygenase 1
(Homo sapiens (Human))
BDBM50145160
(CHEMBL3764846)
Show SMILES CC1(C)C(=O)Nc2ccc(cc12)S(=O)(=O)NNc1ccc(Br)cc1
Show InChI InChI=1S/C16H16BrN3O3S/c1-16(2)13-9-12(7-8-14(13)18-15(16)21)24(22,23)20-19-11-5-3-10(17)4-6-11/h3-9,19-20H,1-2H3,(H,18,21)
Reactome pathway
n/an/an/an/a 36n/an/an/an/a
National Health Research Institutes
Curated by ChEMBL
Assay Description
Inhibition of Indoleamine 2,3-dioxygenase in human HeLa cells in presence of L-tryptophan as substrate after 24 hrs in presence of L-tryptophan
J Med Chem 59: 419-30 (2016)
BindingDB Entry DOI: 10.7270/Q2FF3V69