BDBM50145279 1-{4-[(9-Fluoro-5,6-dihydro-4H-3-thia-1-aza-benzo[e]azulen-2-ylamino)-methyl]-piperidin-1-yl}-2-methoxy-ethanone::CHEMBL313087
SMILES: COCC(=O)N1CCC(CNc2nc-3c(CCCc4ccc(F)cc-34)s2)CC1
InChI Key: InChIKey=UNOSAKGFJYYEOC-UHFFFAOYSA-N
Data: 1 IC50
Activity Spreadsheet -- Enzyme Inhibition Constant Data from BindingDB
Found 1 hit for monomerid = 50145279
Trg + Lig
Ki
nM
ΔG°
kcal/mole
IC50
nM
Kd
nM
EC50/IC50
nM
koff
s-1
kon
M-1s-1
pHTemp
°C
Neuropeptide Y receptor type 5 ( NPY Y5)
(Homo sapiens (Human))
BDBM50145279
(1-{4-[(9-Fluoro-5,6-dihydro-4H-3-thia-1-aza-benzo[...)
Show SMILES COCC(=O)N1CCC(CNc2nc-3c(CCCc4ccc(F)cc-34)s2)CC1
Show InChI InChI=1S/C21H26FN3O2S/c1-27-13-19(26)25-9-7-14(8-10-25)12-23-21-24-20-17-11-16(22)6-5-15(17)3-2-4-18(20)28-21/h5-6,11,14H,2-4,7-10,12-13H2,1H3,(H,23,24)
n/an/a 2n/an/an/an/an/an/a
Novartis Pharma AG
Curated by ChEMBL
Assay Description
In vitro binding affinity of the compound against human neuropeptide Y5 receptor
Bioorg Med Chem Lett 14: 2451-7 (2004)
Article DOI: 10.1016/j.bmcl.2004.03.014
BindingDB Entry DOI: 10.7270/Q2WM1CV1