BDBM50145324 (2-m-Tolyl-ethyl)-[6-(3-trifluoromethyl-[1,2,4]triazolo[3,4-a]phthalazin-6-yloxymethyl)-pyridin-2-ylmethyl]-amine::CHEMBL84228
SMILES: Cc1cccc(CCNCc2cccc(COc3nn4c(nnc4c4ccccc34)C(F)(F)F)n2)c1
InChI Key: InChIKey=RYMZIKAFQDOIJA-UHFFFAOYSA-N
Data: 1 IC50
Activity Spreadsheet -- Enzyme Inhibition Constant Data from BindingDB
Found 1 hit for monomerid = 50145324
Trg + Lig
Ki
nM
ΔG°
kcal/mole
IC50
nM
Kd
nM
EC50/IC50
nM
koff
s-1
kon
M-1s-1
pHTemp
°C
Voltage-dependent calcium channel subunit alpha-2/delta-1
(Homo sapiens (Human))
BDBM50145324
((2-m-Tolyl-ethyl)-[6-(3-trifluoromethyl-[1,2,4]tri...)
Show SMILES Cc1cccc(CCNCc2cccc(COc3nn4c(nnc4c4ccccc34)C(F)(F)F)n2)c1
Show InChI InChI=1S/C26H23F3N6O/c1-17-6-4-7-18(14-17)12-13-30-15-19-8-5-9-20(31-19)16-36-24-22-11-3-2-10-21(22)23-32-33-25(26(27,28)29)35(23)34-24/h2-11,14,30H,12-13,15-16H2,1H3
n/an/a 15n/an/an/an/an/an/a
Merck Research Laboratories
Curated by ChEMBL
Assay Description
Binding affinity against alpha2 delta-1 subunit of voltage-gated calcium channel in human.
Bioorg Med Chem Lett 14: 2463-7 (2004)
Article DOI: 10.1016/j.bmcl.2004.03.008
BindingDB Entry DOI: 10.7270/Q23X876G