BDBM50145820 3-(4-Hydroxy-3,5-diiodo-phenyl)-propionic acid::CHEMBL83092
SMILES: OC(=O)CCc1cc(I)c(O)c(I)c1
InChI Key: InChIKey=REWXSFYNOFYMNX-UHFFFAOYSA-N
Data: 1 KI  1 Kd
Activity Spreadsheet -- Enzyme Inhibition Constant Data from BindingDB
Found 2 hits for monomerid = 50145820
Trg + Lig
Ki
nM
ΔG°
kcal/mole
IC50
nM
Kd
nM
EC50/IC50
nM
koff
s-1
kon
M-1s-1
pHTemp
°C
Genome polyprotein
(Hepatitis C virus)
BDBM50145820
(3-(4-Hydroxy-3,5-diiodo-phenyl)-propionic acid | C...)
Show SMILES OC(=O)CCc1cc(I)c(O)c(I)c1
Show InChI InChI=1S/C9H8I2O3/c10-6-3-5(1-2-8(12)13)4-7(11)9(6)14/h3-4,14H,1-2H2,(H,12,13)
8.00E+4n/an/an/an/an/an/an/an/a
Schering-Plough Research Institute
Curated by ChEMBL
Assay Description
Inhibition constant for HCV NS3 protease substrate binding site
J Med Chem 47: 2486-98 (2004)
Article DOI: 10.1021/jm0305117
BindingDB Entry DOI: 10.7270/Q2FF3RSP
Genome polyprotein
(Hepatitis C virus)
BDBM50145820
(3-(4-Hydroxy-3,5-diiodo-phenyl)-propionic acid | C...)
Show SMILES OC(=O)CCc1cc(I)c(O)c(I)c1
Show InChI InChI=1S/C9H8I2O3/c10-6-3-5(1-2-8(12)13)4-7(11)9(6)14/h3-4,14H,1-2H2,(H,12,13)
n/an/an/a 9.00E+4n/an/an/an/an/a
Schering-Plough Research Institute
Curated by ChEMBL
Assay Description
Dissociation constant for HCV NS3 protease substrate binding site
J Med Chem 47: 2486-98 (2004)
Article DOI: 10.1021/jm0305117
BindingDB Entry DOI: 10.7270/Q2FF3RSP