BDBM50145839 (4-Amino-phenyl)-phenyl-methanone::CHEMBL314211
SMILES: Nc1ccc(cc1)C(=O)c1ccccc1
InChI Key: InChIKey=RBKHNGHPZZZJCI-UHFFFAOYSA-N
Data: 1 Kd
Activity Spreadsheet -- Enzyme Inhibition Constant Data from BindingDB
Found 1 hit for monomerid = 50145839
Trg + Lig
Ki
nM
ΔG°
kcal/mole
IC50
nM
Kd
nM
EC50/IC50
nM
koff
s-1
kon
M-1s-1
pHTemp
°C
Hepatitis C virus serine protease, NS3/NS4A
(Hepatitis C virus)
BDBM50145839
((4-Amino-phenyl)-phenyl-methanone | CHEMBL314211)
Show SMILES Nc1ccc(cc1)C(=O)c1ccccc1
Show InChI InChI=1S/C13H11NO/c14-12-8-6-11(7-9-12)13(15)10-4-2-1-3-5-10/h1-9H,14H2
n/an/an/a>3.00E+4n/an/an/an/an/a
Schering-Plough Research Institute
Curated by ChEMBL
Assay Description
Dissociation constant for HCV NS3 protease substrate binding site
J Med Chem 47: 2486-98 (2004)
Article DOI: 10.1021/jm0305117
BindingDB Entry DOI: 10.7270/Q2FF3RSP