BDBM50145840 2-(4-Methyl-benzoyl)-benzoic acid::2-(4-methylbenzoyl)benzoic acid::CHEMBL83270
SMILES: Cc1ccc(cc1)C(=O)c1ccccc1C(O)=O
InChI Key: InChIKey=ICQOWIXIHDDXDI-UHFFFAOYSA-N
Data: 1 IC50  1 Kd
Activity Spreadsheet -- Enzyme Inhibition Constant Data from BindingDB
Found 2 hits for monomerid = 50145840
Trg + Lig
Ki
nM
ΔG°
kcal/mole
IC50
nM
Kd
nM
EC50/IC50
nM
koff
s-1
kon
M-1s-1
pHTemp
°C
17-beta-Hydroxysteroid Dehydrogenase 5 (17-beta-HSD5, AKR1C3)
(Homo sapiens (Human))
BDBM50145840
(2-(4-Methyl-benzoyl)-benzoic acid | 2-(4-methylben...)
Show SMILES Cc1ccc(cc1)C(=O)c1ccccc1C(O)=O
Show InChI InChI=1S/C15H12O3/c1-10-6-8-11(9-7-10)14(16)12-4-2-3-5-13(12)15(17)18/h2-9H,1H3,(H,17,18)
n/an/a 4.40E+4n/an/an/an/an/an/a
University of Ljubljana
Curated by ChEMBL
Assay Description
Inhibition of recombinant human AKR1C3
Bioorg Med Chem Lett 15: 5170-5 (2005)
Article DOI: 10.1016/j.bmcl.2005.08.063
BindingDB Entry DOI: 10.7270/Q27D2VX4
Hepatitis C virus serine protease, NS3/NS4A
(Hepatitis C virus)
BDBM50145840
(2-(4-Methyl-benzoyl)-benzoic acid | 2-(4-methylben...)
Show SMILES Cc1ccc(cc1)C(=O)c1ccccc1C(O)=O
Show InChI InChI=1S/C15H12O3/c1-10-6-8-11(9-7-10)14(16)12-4-2-3-5-13(12)15(17)18/h2-9H,1H3,(H,17,18)
n/an/an/a 1.60E+3n/an/an/an/an/a
Schering-Plough Research Institute
Curated by ChEMBL
Assay Description
Dissociation constant for HCV NS3 protease substrate binding site
J Med Chem 47: 2486-98 (2004)
Article DOI: 10.1021/jm0305117
BindingDB Entry DOI: 10.7270/Q2FF3RSP