BDBM50145870 CHEMBL3763700
SMILES: COC(=O)\C=C\c1cnc2[nH]c(cc2c1)C(CC1CCCC1)c1ccc(c(Cl)c1)S(C)(=O)=O
InChI Key: InChIKey=ZGBUVZARNUTINR-JXMROGBWSA-N
Data: 1 EC50
Activity Spreadsheet -- Enzyme Inhibition Constant Data from BindingDB
Found 1 hit for monomerid = 50145870
Trg + Lig
Ki
nM
ΔG°
kcal/mole
IC50
nM
Kd
nM
EC50/IC50
nM
koff
s-1
kon
M-1s-1
pHTemp
°C
Glucokinase/Glucokinase regulatory protein
(Homo sapiens (Human))
BDBM50145870
(CHEMBL3763700)
Show SMILES COC(=O)\C=C\c1cnc2[nH]c(cc2c1)C(CC1CCCC1)c1ccc(c(Cl)c1)S(C)(=O)=O
Show InChI InChI=1S/C25H27ClN2O4S/c1-32-24(29)10-7-17-11-19-14-22(28-25(19)27-15-17)20(12-16-5-3-4-6-16)18-8-9-23(21(26)13-18)33(2,30)31/h7-11,13-16,20H,3-6,12H2,1-2H3,(H,27,28)/b10-7+
NCI pathway
Reactome pathway
n/an/an/an/a 695n/an/an/an/a
Servier Research Institute of Medicinal Chemistry
Curated by ChEMBL
Assay Description
Activation of recombinant human glucokinase assessed as NADPH formation using glucose as substrate incubated for 30 mins in presence of NADP+ and glu...
J Med Chem 59: 687-706 (2016)
BindingDB Entry DOI: 10.7270/Q2CF9S0F