BDBM50145931 CHEMBL3764898
SMILES: CN1CCN(CC1)c1ccc(cc1)-c1ccc(CN2CCCN(C)CC2)cc1
InChI Key: InChIKey=RUMNLISNJUOLGY-UHFFFAOYSA-N
Data: 1 IC50  1 Kd
Activity Spreadsheet -- Enzyme Inhibition Constant Data from BindingDB
Found 2 hits for monomerid = 50145931
Trg + Lig
Ki
nM
ΔG°
kcal/mole
IC50
nM
Kd
nM
EC50/IC50
nM
koff
s-1
kon
M-1s-1
pHTemp
°C
Choline kinase alpha
(Homo sapiens (Human))
BDBM50145931
(CHEMBL3764898)
Show SMILES CN1CCN(CC1)c1ccc(cc1)-c1ccc(CN2CCCN(C)CC2)cc1
Show InChI InChI=1S/C24H34N4/c1-25-12-3-13-27(17-14-25)20-21-4-6-22(7-5-21)23-8-10-24(11-9-23)28-18-15-26(2)16-19-28/h4-11H,3,12-20H2,1-2H3
Reactome pathway
n/an/an/a 769n/an/an/an/an/a
ARIAD Pharmaceuticals, Inc.
Curated by ChEMBL
Assay Description
Binding affinity to human N-terminal truncated ChoKalpha1 (75 to 457 residues) by surface plasmon resonance assay
J Med Chem 59: 671-86 (2016)
BindingDB Entry DOI: 10.7270/Q23X88HX
Choline kinase alpha
(Homo sapiens (Human))
BDBM50145931
(CHEMBL3764898)
Show SMILES CN1CCN(CC1)c1ccc(cc1)-c1ccc(CN2CCCN(C)CC2)cc1
Show InChI InChI=1S/C24H34N4/c1-25-12-3-13-27(17-14-25)20-21-4-6-22(7-5-21)23-8-10-24(11-9-23)28-18-15-26(2)16-19-28/h4-11H,3,12-20H2,1-2H3
Reactome pathway
n/an/a 1.30E+3n/an/an/an/an/an/a
ARIAD Pharmaceuticals, Inc.
Curated by ChEMBL
Assay Description
Inhibition of human N-terminal truncated ChoKalpha1 (75 to 457 residues) using choline chloride as substrate measured over 10 to 30 mins by coupled A...
J Med Chem 59: 671-86 (2016)
BindingDB Entry DOI: 10.7270/Q23X88HX