BDBM50146003 CHEMBL3763453
SMILES: CN1CCCN(Cc2ccc(cc2)-c2cc(F)c(CN3CCCN(C)CC3)c(F)c2)CC1
InChI Key: InChIKey=YHIAWZNILKZQHL-UHFFFAOYSA-N
Data: 1 IC50  1 Kd
Activity Spreadsheet -- Enzyme Inhibition Constant Data from BindingDB
Found 2 hits for monomerid = 50146003
Trg + Lig
Ki
nM
ΔG°
kcal/mole
IC50
nM
Kd
nM
EC50/IC50
nM
koff
s-1
kon
M-1s-1
pHTemp
°C
Choline kinase alpha
(Homo sapiens (Human))
BDBM50146003
(CHEMBL3763453)
Show SMILES CN1CCCN(Cc2ccc(cc2)-c2cc(F)c(CN3CCCN(C)CC3)c(F)c2)CC1
Show InChI InChI=1S/C26H36F2N4/c1-29-9-3-11-31(15-13-29)19-21-5-7-22(8-6-21)23-17-25(27)24(26(28)18-23)20-32-12-4-10-30(2)14-16-32/h5-8,17-18H,3-4,9-16,19-20H2,1-2H3
Reactome pathway
n/an/an/a 259n/an/an/an/an/a
ARIAD Pharmaceuticals, Inc.
Curated by ChEMBL
Assay Description
Binding affinity to human N-terminal truncated ChoKalpha1 (75 to 457 residues) by surface plasmon resonance assay
J Med Chem 59: 671-86 (2016)
BindingDB Entry DOI: 10.7270/Q23X88HX
Choline kinase alpha
(Homo sapiens (Human))
BDBM50146003
(CHEMBL3763453)
Show SMILES CN1CCCN(Cc2ccc(cc2)-c2cc(F)c(CN3CCCN(C)CC3)c(F)c2)CC1
Show InChI InChI=1S/C26H36F2N4/c1-29-9-3-11-31(15-13-29)19-21-5-7-22(8-6-21)23-17-25(27)24(26(28)18-23)20-32-12-4-10-30(2)14-16-32/h5-8,17-18H,3-4,9-16,19-20H2,1-2H3
Reactome pathway
n/an/a 255n/an/an/an/an/an/a
ARIAD Pharmaceuticals, Inc.
Curated by ChEMBL
Assay Description
Inhibition of human N-terminal truncated ChoKalpha1 (75 to 457 residues) using choline chloride as substrate measured over 10 to 30 mins by coupled A...
J Med Chem 59: 671-86 (2016)
BindingDB Entry DOI: 10.7270/Q23X88HX