BDBM50146064 8-Methoxy-1,2-dihydro-benzo[f]chromen-3-one::CHEMBL88987
SMILES: COc1ccc2c3CCC(=O)Oc3ccc2c1
InChI Key: InChIKey=MITIQHFJBPZMLG-UHFFFAOYSA-N
Data: 1 IC50
Activity Spreadsheet -- Enzyme Inhibition Constant Data from BindingDB
Found 1 hit for monomerid = 50146064
Trg + Lig
Ki
nM
ΔG°
kcal/mole
IC50
nM
Kd
nM
EC50/IC50
nM
koff
s-1
kon
M-1s-1
pHTemp
°C
NAD-dependent histone deacetylase SIR2
(Saccharomyces cerevisiae)
BDBM50146064
(8-Methoxy-1,2-dihydro-benzo[f]chromen-3-one | CHEM...)
Show SMILES COc1ccc2c3CCC(=O)Oc3ccc2c1
Show InChI InChI=1S/C14H12O3/c1-16-10-3-4-11-9(8-10)2-6-13-12(11)5-7-14(15)17-13/h2-4,6,8H,5,7H2,1H3
Reactome pathway
n/an/a 7.30E+4n/an/an/an/an/an/a
Fred Hutchinson Cancer Research Center
Curated by ChEMBL
Assay Description
In vitro inhibition of sirtuin 2 was evaluated using yeast whole cell lysates
J Med Chem 47: 2635-44 (2004)
Article DOI: 10.1021/jm030473r
BindingDB Entry DOI: 10.7270/Q228071B