BDBM50146957 2-(S)-Amino-1-piperidin-1-yl-4-[(thiophen-2-ylmethyl)-amino]-butan-1-one::CHEMBL98423
SMILES: N[C@@H](CCNCc1cccs1)C(=O)N1CCCCC1
InChI Key: InChIKey=VUZNUKCZPSOACZ-ZDUSSCGKSA-N
Data: 2 IC50
Activity Spreadsheet -- Enzyme Inhibition Constant Data from BindingDB
Found 2 hits for monomerid = 50146957
Trg + Lig
Ki
nM
ΔG°
kcal/mole
IC50
nM
Kd
nM
EC50/IC50
nM
koff
s-1
kon
M-1s-1
pHTemp
°C
Dipeptidyl peptidase 2 (DPP II)
(Homo sapiens (Human))
BDBM50146957
(2-(S)-Amino-1-piperidin-1-yl-4-[(thiophen-2-ylmeth...)
Show SMILES N[C@@H](CCNCc1cccs1)C(=O)N1CCCCC1
Show InChI InChI=1S/C14H23N3OS/c15-13(14(18)17-8-2-1-3-9-17)6-7-16-11-12-5-4-10-19-12/h4-5,10,13,16H,1-3,6-9,11,15H2/t13-/m0/s1
n/an/a 0.800n/an/an/an/an/an/a
University of Antwerp
Curated by ChEMBL
Assay Description
Inhibition of human Dipeptidyl-peptidase II (DPP II)
J Med Chem 47: 2906-16 (2004)
Article DOI: 10.1021/jm031122f
BindingDB Entry DOI: 10.7270/Q2TH8M4H
Dipeptidyl peptidase 4
(Homo sapiens (Human))
BDBM50146957
(2-(S)-Amino-1-piperidin-1-yl-4-[(thiophen-2-ylmeth...)
Show SMILES N[C@@H](CCNCc1cccs1)C(=O)N1CCCCC1
Show InChI InChI=1S/C14H23N3OS/c15-13(14(18)17-8-2-1-3-9-17)6-7-16-11-12-5-4-10-19-12/h4-5,10,13,16H,1-3,6-9,11,15H2/t13-/m0/s1
Reactome pathway
n/an/a 2.78E+5n/an/an/an/an/an/a
University of Antwerp
Curated by ChEMBL
Assay Description
Inhibition of human Dipeptidyl-peptidase IV (DPP IV)
J Med Chem 47: 2906-16 (2004)
Article DOI: 10.1021/jm031122f
BindingDB Entry DOI: 10.7270/Q2TH8M4H