BDBM50146961 2-(S)-Amino-4-(3-chloro-benzylamino)-1-piperidin-1-yl-butan-1-one::CHEMBL317949
SMILES: N[C@@H](CCNCc1cccc(Cl)c1)C(=O)N1CCCCC1
InChI Key: InChIKey=ADQJKWZAJIPGIT-HNNXBMFYSA-N
Data: 2 IC50
Activity Spreadsheet -- Enzyme Inhibition Constant Data from BindingDB
Found 2 hits for monomerid = 50146961
Trg + Lig
Ki
nM
ΔG°
kcal/mole
IC50
nM
Kd
nM
EC50/IC50
nM
koff
s-1
kon
M-1s-1
pHTemp
°C
Dipeptidyl peptidase 4
(Homo sapiens (Human))
BDBM50146961
(2-(S)-Amino-4-(3-chloro-benzylamino)-1-piperidin-1...)
Show SMILES N[C@@H](CCNCc1cccc(Cl)c1)C(=O)N1CCCCC1
Show InChI InChI=1S/C16H24ClN3O/c17-14-6-4-5-13(11-14)12-19-8-7-15(18)16(21)20-9-2-1-3-10-20/h4-6,11,15,19H,1-3,7-10,12,18H2/t15-/m0/s1
Reactome pathway
n/an/a 1.86E+5n/an/an/an/an/an/a
University of Antwerp
Curated by ChEMBL
Assay Description
Inhibition of human Dipeptidyl-peptidase IV (DPP IV)
J Med Chem 47: 2906-16 (2004)
Article DOI: 10.1021/jm031122f
BindingDB Entry DOI: 10.7270/Q2TH8M4H
Dipeptidyl peptidase 2 (DPP II)
(Homo sapiens (Human))
BDBM50146961
(2-(S)-Amino-4-(3-chloro-benzylamino)-1-piperidin-1...)
Show SMILES N[C@@H](CCNCc1cccc(Cl)c1)C(=O)N1CCCCC1
Show InChI InChI=1S/C16H24ClN3O/c17-14-6-4-5-13(11-14)12-19-8-7-15(18)16(21)20-9-2-1-3-10-20/h4-6,11,15,19H,1-3,7-10,12,18H2/t15-/m0/s1
n/an/a 1.34n/an/an/an/an/an/a
University of Antwerp
Curated by ChEMBL
Assay Description
Inhibition of human Dipeptidyl-peptidase II (DPP II)
J Med Chem 47: 2906-16 (2004)
Article DOI: 10.1021/jm031122f
BindingDB Entry DOI: 10.7270/Q2TH8M4H