BDBM50146964 2-(S)-Amino-1-piperidin-1-yl-4-[(pyridin-4-ylmethyl)-amino]-butan-1-one::CHEMBL99111
SMILES: N[C@@H](CCNCc1ccncc1)C(=O)N1CCCCC1
InChI Key: InChIKey=VMCLFUIUGJWEIO-AWEZNQCLSA-N
Data: 2 IC50
Activity Spreadsheet -- Enzyme Inhibition Constant Data from BindingDB
Found 2 hits for monomerid = 50146964
Trg + Lig
Ki
nM
ΔG°
kcal/mole
IC50
nM
Kd
nM
EC50/IC50
nM
koff
s-1
kon
M-1s-1
pHTemp
°C
Dipeptidyl peptidase 4
(Homo sapiens (Human))
BDBM50146964
(2-(S)-Amino-1-piperidin-1-yl-4-[(pyridin-4-ylmethy...)
Show SMILES N[C@@H](CCNCc1ccncc1)C(=O)N1CCCCC1
Show InChI InChI=1S/C15H24N4O/c16-14(15(20)19-10-2-1-3-11-19)6-9-18-12-13-4-7-17-8-5-13/h4-5,7-8,14,18H,1-3,6,9-12,16H2/t14-/m0/s1
Reactome pathway
n/an/a 1.25E+5n/an/an/an/an/an/a
University of Antwerp
Curated by ChEMBL
Assay Description
Inhibition of human Dipeptidyl-peptidase IV (DPP IV)
J Med Chem 47: 2906-16 (2004)
Article DOI: 10.1021/jm031122f
BindingDB Entry DOI: 10.7270/Q2TH8M4H
Dipeptidyl peptidase 2 (DPP II)
(Homo sapiens (Human))
BDBM50146964
(2-(S)-Amino-1-piperidin-1-yl-4-[(pyridin-4-ylmethy...)
Show SMILES N[C@@H](CCNCc1ccncc1)C(=O)N1CCCCC1
Show InChI InChI=1S/C15H24N4O/c16-14(15(20)19-10-2-1-3-11-19)6-9-18-12-13-4-7-17-8-5-13/h4-5,7-8,14,18H,1-3,6,9-12,16H2/t14-/m0/s1
n/an/a 0.75n/an/an/an/an/an/a
University of Antwerp
Curated by ChEMBL
Assay Description
Inhibition of human Dipeptidyl-peptidase II (DPP II)
J Med Chem 47: 2906-16 (2004)
Article DOI: 10.1021/jm031122f
BindingDB Entry DOI: 10.7270/Q2TH8M4H