BDBM50146978 (S)-2-Amino-4-phenylamino-1-piperidin-1-yl-butan-1-one::CHEMBL98415
SMILES: N[C@@H](CCNc1ccccc1)C(=O)N1CCCCC1
InChI Key: InChIKey=ZENZQBSEGSAEED-AWEZNQCLSA-N
Data: 2 IC50
Activity Spreadsheet -- Enzyme Inhibition Constant Data from BindingDB
Found 2 hits for monomerid = 50146978
Trg + Lig
Ki
nM
ΔG°
kcal/mole
IC50
nM
Kd
nM
EC50/IC50
nM
koff
s-1
kon
M-1s-1
pHTemp
°C
Dipeptidyl peptidase 2 (DPP II)
(Homo sapiens (Human))
BDBM50146978
((S)-2-Amino-4-phenylamino-1-piperidin-1-yl-butan-1...)
Show SMILES N[C@@H](CCNc1ccccc1)C(=O)N1CCCCC1
Show InChI InChI=1S/C15H23N3O/c16-14(15(19)18-11-5-2-6-12-18)9-10-17-13-7-3-1-4-8-13/h1,3-4,7-8,14,17H,2,5-6,9-12,16H2/t14-/m0/s1
n/an/a 1.5n/an/an/an/an/an/a
University of Antwerp
Curated by ChEMBL
Assay Description
Inhibition of human Dipeptidyl-peptidase II (DPP II)
J Med Chem 47: 2906-16 (2004)
Article DOI: 10.1021/jm031122f
BindingDB Entry DOI: 10.7270/Q2TH8M4H
Dipeptidyl peptidase 4
(Homo sapiens (Human))
BDBM50146978
((S)-2-Amino-4-phenylamino-1-piperidin-1-yl-butan-1...)
Show SMILES N[C@@H](CCNc1ccccc1)C(=O)N1CCCCC1
Show InChI InChI=1S/C15H23N3O/c16-14(15(19)18-11-5-2-6-12-18)9-10-17-13-7-3-1-4-8-13/h1,3-4,7-8,14,17H,2,5-6,9-12,16H2/t14-/m0/s1
Reactome pathway
n/an/a 2.50E+5n/an/an/an/an/an/a
University of Antwerp
Curated by ChEMBL
Assay Description
Inhibition of human Dipeptidyl-peptidase IV (DPP IV)
J Med Chem 47: 2906-16 (2004)
Article DOI: 10.1021/jm031122f
BindingDB Entry DOI: 10.7270/Q2TH8M4H