BDBM50147461 3-[1-(3-Hydroxy-propyl)-1H-pyrrolo[2,3-b]pyridin-3-yl]-4-(2-trifluoromethyl-phenyl)-pyrrole-2,5-dione::CHEMBL325817
SMILES: OCCCn1cc(C2=C(C(=O)NC2=O)c2ccccc2C(F)(F)F)c2cccnc12
InChI Key: InChIKey=PLUWMEIYYZQPRH-UHFFFAOYSA-N
Data: 3 IC50
Activity Spreadsheet -- Enzyme Inhibition Constant Data from BindingDB
Found 3 hits for monomerid = 50147461
Trg + Lig
Ki
nM
ΔG°
kcal/mole
IC50
nM
Kd
nM
EC50/IC50
nM
koff
s-1
kon
M-1s-1
pHTemp
°C
PKC alpha and beta-2
(Homo sapiens (Human))
BDBM50147461
(3-[1-(3-Hydroxy-propyl)-1H-pyrrolo[2,3-b]pyridin-3...)
Show SMILES OCCCn1cc(C2=C(C(=O)NC2=O)c2ccccc2C(F)(F)F)c2cccnc12 |t:7|
Show InChI InChI=1S/C21H16F3N3O3/c22-21(23,24)15-7-2-1-5-13(15)16-17(20(30)26-19(16)29)14-11-27(9-4-10-28)18-12(14)6-3-8-25-18/h1-3,5-8,11,28H,4,9-10H2,(H,26,29,30)
NCI pathway
Reactome pathway
n/an/a 1.85E+3n/an/an/an/an/an/a
Johnson & Johnson Pharmaceutical Research & Development
Curated by ChEMBL
Assay Description
Inhibitory concentration against human protein kinase C-betaII using histone as substrate
Bioorg Med Chem Lett 14: 3245-50 (2004)
Article DOI: 10.1016/j.bmcl.2004.03.090
BindingDB Entry DOI: 10.7270/Q2W958NH
Glycogen synthase kinase-3 beta
(Homo sapiens (Human))
BDBM50147461
(3-[1-(3-Hydroxy-propyl)-1H-pyrrolo[2,3-b]pyridin-3...)
Show SMILES OCCCn1cc(C2=C(C(=O)NC2=O)c2ccccc2C(F)(F)F)c2cccnc12 |t:7|
Show InChI InChI=1S/C21H16F3N3O3/c22-21(23,24)15-7-2-1-5-13(15)16-17(20(30)26-19(16)29)14-11-27(9-4-10-28)18-12(14)6-3-8-25-18/h1-3,5-8,11,28H,4,9-10H2,(H,26,29,30)
NCI pathway
Reactome pathway
n/an/a 14n/an/an/an/an/an/a
Wuhan Institute of Technology
Curated by ChEMBL
Assay Description
Inhibition of human Protein kinase C beta 2
Eur J Med Chem 164: 448-470 (2019)
Article DOI: 10.1007/s00044-005-0126-y
BindingDB Entry DOI: 10.7270/Q2WH2SVB
Glycogen synthase kinase-3 beta
(Homo sapiens (Human))
BDBM50147461
(3-[1-(3-Hydroxy-propyl)-1H-pyrrolo[2,3-b]pyridin-3...)
Show SMILES OCCCn1cc(C2=C(C(=O)NC2=O)c2ccccc2C(F)(F)F)c2cccnc12 |t:7|
Show InChI InChI=1S/C21H16F3N3O3/c22-21(23,24)15-7-2-1-5-13(15)16-17(20(30)26-19(16)29)14-11-27(9-4-10-28)18-12(14)6-3-8-25-18/h1-3,5-8,11,28H,4,9-10H2,(H,26,29,30)
NCI pathway
Reactome pathway
n/an/a 14n/an/an/an/an/an/a
Johnson & Johnson Pharmaceutical Research & Development
Curated by ChEMBL
Assay Description
Inhibitory concentration against rabbit glycogen synthase kinase-3 beta using protein phosphatase inhibitor-2 as substrate
Bioorg Med Chem Lett 14: 3245-50 (2004)
Article DOI: 10.1016/j.bmcl.2004.03.090
BindingDB Entry DOI: 10.7270/Q2W958NH