BDBM50147472 3-[1-(3-Hydroxy-propyl)-1H-pyrrolo[2,3-b]pyridin-3-yl]-4-(2-methoxy-phenyl)-pyrrole-2,5-dione::CHEMBL111298
SMILES: COc1ccccc1C1=C(C(=O)NC1=O)c1cn(CCCO)c2ncccc12
InChI Key: InChIKey=PDZRGSNSFAAGRB-UHFFFAOYSA-N
Data: 3 IC50
Activity Spreadsheet -- Enzyme Inhibition Constant Data from BindingDB
Found 3 hits for monomerid = 50147472
Trg + Lig
Ki
nM
ΔG°
kcal/mole
IC50
nM
Kd
nM
EC50/IC50
nM
koff
s-1
kon
M-1s-1
pHTemp
°C
Glycogen synthase kinase-3 beta
(Homo sapiens (Human))
BDBM50147472
(3-[1-(3-Hydroxy-propyl)-1H-pyrrolo[2,3-b]pyridin-3...)
Show SMILES COc1ccccc1C1=C(C(=O)NC1=O)c1cn(CCCO)c2ncccc12 |t:9|
Show InChI InChI=1S/C21H19N3O4/c1-28-16-8-3-2-6-14(16)17-18(21(27)23-20(17)26)15-12-24(10-5-11-25)19-13(15)7-4-9-22-19/h2-4,6-9,12,25H,5,10-11H2,1H3,(H,23,26,27)
NCI pathway
Reactome pathway
n/an/a 4n/an/an/an/an/an/a
Johnson & Johnson Pharmaceutical Research & Development
Curated by ChEMBL
Assay Description
Inhibitory concentration against rabbit glycogen synthase kinase-3 beta using protein phosphatase inhibitor-2 as substrate
Bioorg Med Chem Lett 14: 3245-50 (2004)
Article DOI: 10.1016/j.bmcl.2004.03.090
BindingDB Entry DOI: 10.7270/Q2W958NH
Glycogen synthase kinase-3 beta
(Homo sapiens (Human))
BDBM50147472
(3-[1-(3-Hydroxy-propyl)-1H-pyrrolo[2,3-b]pyridin-3...)
Show SMILES COc1ccccc1C1=C(C(=O)NC1=O)c1cn(CCCO)c2ncccc12 |t:9|
Show InChI InChI=1S/C21H19N3O4/c1-28-16-8-3-2-6-14(16)17-18(21(27)23-20(17)26)15-12-24(10-5-11-25)19-13(15)7-4-9-22-19/h2-4,6-9,12,25H,5,10-11H2,1H3,(H,23,26,27)
NCI pathway
Reactome pathway
n/an/a 4n/an/an/an/an/an/a
Wuhan Institute of Technology
Curated by ChEMBL
Assay Description
Inhibition of human Protein kinase C alpha
Eur J Med Chem 164: 448-470 (2019)
Article DOI: 10.1007/s00044-005-0126-y
BindingDB Entry DOI: 10.7270/Q2WH2SVB
PKC alpha and beta-2
(Homo sapiens (Human))
BDBM50147472
(3-[1-(3-Hydroxy-propyl)-1H-pyrrolo[2,3-b]pyridin-3...)
Show SMILES COc1ccccc1C1=C(C(=O)NC1=O)c1cn(CCCO)c2ncccc12 |t:9|
Show InChI InChI=1S/C21H19N3O4/c1-28-16-8-3-2-6-14(16)17-18(21(27)23-20(17)26)15-12-24(10-5-11-25)19-13(15)7-4-9-22-19/h2-4,6-9,12,25H,5,10-11H2,1H3,(H,23,26,27)
NCI pathway
Reactome pathway
n/an/a 1.44E+3n/an/an/an/an/an/a
Johnson & Johnson Pharmaceutical Research & Development
Curated by ChEMBL
Assay Description
Inhibitory concentration against human protein kinase C-betaII using histone as substrate
Bioorg Med Chem Lett 14: 3245-50 (2004)
Article DOI: 10.1016/j.bmcl.2004.03.090
BindingDB Entry DOI: 10.7270/Q2W958NH