BDBM50147570 CHEMBL109737::Dodecyl-dimethyl-amine::N,N-dimethyldodecan-1-amine::NSC-7332
SMILES: CCCCCCCCCCCCN(C)C
InChI Key: InChIKey=YWFWDNVOPHGWMX-UHFFFAOYSA-N
Data: 1 IC50
Activity Spreadsheet -- Enzyme Inhibition Constant Data from BindingDB
Found 1 hit for monomerid = 50147570
Trg + Lig
Ki
nM
ΔG°
kcal/mole
IC50
nM
Kd
nM
EC50/IC50
nM
koff
s-1
kon
M-1s-1
pHTemp
°C
Dynamin-1
(Homo sapiens (Human))
BDBM50147570
(CHEMBL109737 | Dodecyl-dimethyl-amine | N,N-dimeth...)
Show SMILES CCCCCCCCCCCCN(C)C
Show InChI InChI=1S/C14H31N/c1-4-5-6-7-8-9-10-11-12-13-14-15(2)3/h4-14H2,1-3H3
NCI pathway
Reactome pathway
n/an/a 1.48E+4n/an/an/an/an/an/a
The University of Newcastle
Curated by ChEMBL
Assay Description
Concentration required against dynamin-1 GTPase activity of sheep brain.
Bioorg Med Chem Lett 14: 3275-8 (2004)
Article DOI: 10.1016/j.bmcl.2004.03.096
BindingDB Entry DOI: 10.7270/Q27M07CT