BDBM50147612 CHEMBL3765158
SMILES: OC(=O)CN(C1(CCC1)c1cccc(c1)-c1cc(Cl)cc(Cl)c1)S(=O)(=O)c1ccc(OC(F)F)cc1
InChI Key: InChIKey=OWTNWQIYMJJSLO-UHFFFAOYSA-N
Data: 1 IC50
Activity Spreadsheet -- Enzyme Inhibition Constant Data from BindingDB
Found 1 hit for monomerid = 50147612
Trg + Lig
Ki
nM
ΔG°
kcal/mole
IC50
nM
Kd
nM
EC50/IC50
nM
koff
s-1
kon
M-1s-1
pHTemp
°C
Sn1-specific diacylglycerol lipase alpha
(Homo sapiens (Human))
BDBM50147612
(CHEMBL3765158)
Show SMILES OC(=O)CN(C1(CCC1)c1cccc(c1)-c1cc(Cl)cc(Cl)c1)S(=O)(=O)c1ccc(OC(F)F)cc1
Show InChI InChI=1S/C25H21Cl2F2NO5S/c26-19-12-17(13-20(27)14-19)16-3-1-4-18(11-16)25(9-2-10-25)30(15-23(31)32)36(33,34)22-7-5-21(6-8-22)35-24(28)29/h1,3-8,11-14,24H,2,9-10,15H2,(H,31,32)
NCI pathway
Reactome pathway
n/an/a 11n/an/an/an/an/an/a
Bristol-Myers Squibb Co.
Curated by ChEMBL
Assay Description
Inhibition of full length human C-terminal HA-tagged DAGLalpha expressed in HEK293 cell membrane using DAG as substrate incubated for 20 mins by LC-M...
Bioorg Med Chem 24: 1455-68 (2016)
BindingDB Entry DOI: 10.7270/Q2RJ4MBD