BDBM50147723 CHEMBL3764019
SMILES: CN(C)c1ccc(\C=N\NC(=O)c2c(C)nc3sc4ccccc4n23)cc1
InChI Key: InChIKey=CUSLPDYGWJRFED-CIAFOILYSA-N
Data: 1 IC50
Activity Spreadsheet -- Enzyme Inhibition Constant Data from BindingDB
Found 1 hit for monomerid = 50147723
Trg + Lig
Ki
nM
ΔG°
kcal/mole
IC50
nM
Kd
nM
EC50/IC50
nM
koff
s-1
kon
M-1s-1
pHTemp
°C
Pantothenate synthetase
(Mycobacterium tuberculosis (strain ATCC 25618 / H3...)
BDBM50147723
(CHEMBL3764019)
Show SMILES CN(C)c1ccc(\C=N\NC(=O)c2c(C)nc3sc4ccccc4n23)cc1
Show InChI InChI=1S/C20H19N5OS/c1-13-18(25-16-6-4-5-7-17(16)27-20(25)22-13)19(26)23-21-12-14-8-10-15(11-9-14)24(2)3/h4-12H,1-3H3,(H,23,26)/b21-12+
n/an/a 1.46E+3n/an/an/an/an/an/a
Birla Institute of Technology& Science-Pilani
Curated by ChEMBL
Assay Description
Inhibition of Mycobacterium tuberculosis pantothenate synthetase using pantoic acid as substrate and beta-alanine as reactant assessed as NAD+ format...
Bioorg Med Chem 24: 1298-307 (2016)
BindingDB Entry DOI: 10.7270/Q2C82C5B