BDBM50147970 2-Guanidino-4-methyl-pentanoic acid (2-{4-[5-(2,3-dichloro-4-hydroxy-phenyl)-2-methyl-2H-pyrazol-3-yl]-piperidin-1-yl}-2-oxo-ethyl)-amide::CHEMBL105780
SMILES: [#6]-[#6](-[#6])-[#6]-[#6@@H](\[#7]=[#6](/[#7])-[#7])-[#6](=O)-[#7]-[#6]-[#6](=O)-[#7]-1-[#6]-[#6]-[#6](-[#6]-[#6]-1)-c1cc(nn1-[#6])-c1ccc(-[#8])c(Cl)c1Cl
InChI Key: InChIKey=JBUWVUTXZMCPRZ-QGZVFWFLSA-N
Data: 1 IC50
Activity Spreadsheet -- Enzyme Inhibition Constant Data from BindingDB
Found 1 hit for monomerid = 50147970
Trg + Lig
Ki
nM
ΔG°
kcal/mole
IC50
nM
Kd
nM
EC50/IC50
nM
koff
s-1
kon
M-1s-1
pHTemp
°C
Interleukin-2 receptor alpha chain
(Mus musculus)
BDBM50147970
(2-Guanidino-4-methyl-pentanoic acid (2-{4-[5-(2,3-...)
Show SMILES [#6]-[#6](-[#6])-[#6]-[#6@@H](\[#7]=[#6](/[#7])-[#7])-[#6](=O)-[#7]-[#6]-[#6](=O)-[#7]-1-[#6]-[#6]-[#6](-[#6]-[#6]-1)-c1cc(nn1-[#6])-c1ccc(-[#8])c(Cl)c1Cl
Show InChI InChI=1S/C24H33Cl2N7O3/c1-13(2)10-17(30-24(27)28)23(36)29-12-20(35)33-8-6-14(7-9-33)18-11-16(31-32(18)3)15-4-5-19(34)22(26)21(15)25/h4-5,11,13-14,17,34H,6-10,12H2,1-3H3,(H,29,36)(H4,27,28,30)/t17-/m1/s1
Reactome pathway
n/an/a 8.10E+3n/an/an/an/an/an/a
Sunesis Pharmaceuticals Inc.
Curated by ChEMBL
Assay Description
Concentration required to inhibit mouse interleukin-2 alpha receptor was determined by SPA assay
J Med Chem 47: 3111-30 (2004)
Article DOI: 10.1021/jm049967u
BindingDB Entry DOI: 10.7270/Q2TQ6280