BDBM50148006 (S)-2-[2-((R)-3-Cyclohexyl-2-guanidino-propionylamino)-acetylamino]-3-(4-phenylethynyl-phenyl)-propionic acid methyl ester::CHEMBL108470
SMILES: [#6]-[#8]-[#6](=O)-[#6@H](-[#6]-c1ccc(cc1)C#Cc1ccccc1)-[#7]-[#6](=O)-[#6]-[#7]-[#6](=O)-[#6@@H](-[#6]-[#6]-1-[#6]-[#6]-[#6]-[#6]-[#6]-1)\[#7]=[#6](/[#7])-[#7]
InChI Key: InChIKey=MCWWAEOCNFUYJG-FTJBHMTQSA-N
Data: 1 IC50
Activity Spreadsheet -- Enzyme Inhibition Constant Data from BindingDB
Found 1 hit for monomerid = 50148006
Trg + Lig
Ki
nM
ΔG°
kcal/mole
IC50
nM
Kd
nM
EC50/IC50
nM
koff
s-1
kon
M-1s-1
pHTemp
°C
Interleukin-2 receptor alpha chain
(Mus musculus)
BDBM50148006
((S)-2-[2-((R)-3-Cyclohexyl-2-guanidino-propionylam...)
Show SMILES [#6]-[#8]-[#6](=O)-[#6@H](-[#6]-c1ccc(cc1)C#Cc1ccccc1)-[#7]-[#6](=O)-[#6]-[#7]-[#6](=O)-[#6@@H](-[#6]-[#6]-1-[#6]-[#6]-[#6]-[#6]-[#6]-1)\[#7]=[#6](/[#7])-[#7]
Show InChI InChI=1S/C30H37N5O4/c1-39-29(38)26(19-24-16-14-22(15-17-24)13-12-21-8-4-2-5-9-21)34-27(36)20-33-28(37)25(35-30(31)32)18-23-10-6-3-7-11-23/h2,4-5,8-9,14-17,23,25-26H,3,6-7,10-11,18-20H2,1H3,(H,33,37)(H,34,36)(H4,31,32,35)/t25-,26+/m1/s1
Reactome pathway
n/an/a 3.70E+4n/an/an/an/an/an/a
Sunesis Pharmaceuticals Inc.
Curated by ChEMBL
Assay Description
Inhibition of mouse interleukin-2 alpha receptor by ELISA
J Med Chem 47: 3111-30 (2004)
Article DOI: 10.1021/jm049967u
BindingDB Entry DOI: 10.7270/Q2TQ6280