BDBM50148195 CHEMBL3765188
SMILES: [H][C@@]12CC=CC[C@]1([H])C(=NN(C1CCCCCC1)C2=O)c1ccc(OC)c(OCCCCOc2ccc(cc2)-c2nnn(C)n2)c1
InChI Key: InChIKey=OKHIBGYAOMMETC-URLMMPGGSA-N
Data: 2 IC50
Activity Spreadsheet -- Enzyme Inhibition Constant Data from BindingDB
Found 2 hits for monomerid = 50148195
Trg + Lig
Ki
nM
ΔG°
kcal/mole
IC50
nM
Kd
nM
EC50/IC50
nM
koff
s-1
kon
M-1s-1
pHTemp
°C
Class I phosphodiesterase B1 (TbrPDEB1)
(Trypanosoma brucei)
BDBM50148195
(CHEMBL3765188)
Show SMILES [H][C@@]12CC=CC[C@]1([H])C(=NN(C1CCCCCC1)C2=O)c1ccc(OC)c(OCCCCOc2ccc(cc2)-c2nnn(C)n2)c1 |r,c:3,9|
Show InChI InChI=1S/C34H42N6O4/c1-39-37-33(35-38-39)24-15-18-27(19-16-24)43-21-9-10-22-44-31-23-25(17-20-30(31)42-2)32-28-13-7-8-14-29(28)34(41)40(36-32)26-11-5-3-4-6-12-26/h7-8,15-20,23,26,28-29H,3-6,9-14,21-22H2,1-2H3/t28-,29+/m0/s1
n/an/a 3.20n/an/an/an/an/an/a
Mercachem
Curated by ChEMBL
Assay Description
Inhibition of recombinant Trypanosoma brucei PDEB1 using [3H]-cAMP as substrate after 15 mins by scintillation proximity assay
Bioorg Med Chem 24: 1573-81 (2016)
BindingDB Entry DOI: 10.7270/Q22V2J07
cAMP-specific 3',5'-cyclic phosphodiesterase 4B
(Homo sapiens (Human))
BDBM50148195
(CHEMBL3765188)
Show SMILES [H][C@@]12CC=CC[C@]1([H])C(=NN(C1CCCCCC1)C2=O)c1ccc(OC)c(OCCCCOc2ccc(cc2)-c2nnn(C)n2)c1 |r,c:3,9|
Show InChI InChI=1S/C34H42N6O4/c1-39-37-33(35-38-39)24-15-18-27(19-16-24)43-21-9-10-22-44-31-23-25(17-20-30(31)42-2)32-28-13-7-8-14-29(28)34(41)40(36-32)26-11-5-3-4-6-12-26/h7-8,15-20,23,26,28-29H,3-6,9-14,21-22H2,1-2H3/t28-,29+/m0/s1
n/an/a 0.501n/an/an/an/an/an/a
Mercachem
Curated by ChEMBL
Assay Description
Inhibition of full length human recombinant PDE4B1 using [3H]-cAMP as substrate by scintillation proximity assay
Bioorg Med Chem 24: 1573-81 (2016)
BindingDB Entry DOI: 10.7270/Q22V2J07