BDBM50148197 1-[4-(4-Fluoro-phenoxy)-benzenesulfonylamino]-cyclopropanecarboxylic acid hydroxyamide::CHEMBL114884
SMILES: ONC(=O)C1(CC1)NS(=O)(=O)c1ccc(Oc2ccc(F)cc2)cc1
InChI Key: InChIKey=OCDVFODZPZVZMF-UHFFFAOYSA-N
Data: 2 IC50
Activity Spreadsheet -- Enzyme Inhibition Constant Data from BindingDB
Found 2 hits for monomerid = 50148197
Trg + Lig
Ki
nM
ΔG°
kcal/mole
IC50
nM
Kd
nM
EC50/IC50
nM
koff
s-1
kon
M-1s-1
pHTemp
°C
Interstitial collagenase
(Homo sapiens (Human))
BDBM50148197
(1-[4-(4-Fluoro-phenoxy)-benzenesulfonylamino]-cycl...)
Show SMILES ONC(=O)C1(CC1)NS(=O)(=O)c1ccc(Oc2ccc(F)cc2)cc1
Show InChI InChI=1S/C16H15FN2O5S/c17-11-1-3-12(4-2-11)24-13-5-7-14(8-6-13)25(22,23)19-16(9-10-16)15(20)18-21/h1-8,19,21H,9-10H2,(H,18,20)
Reactome pathway
n/an/a 500n/an/an/an/an/an/a
Pfizer Inc.
Curated by ChEMBL
Assay Description
Inhibitory activity against human matrix metalloprotease-1 (MMP-1)
Bioorg Med Chem Lett 14: 3389-95 (2004)
Article DOI: 10.1016/j.bmcl.2004.04.083
BindingDB Entry DOI: 10.7270/Q25Q4WPN
Collagenase 3
(Homo sapiens (Human))
BDBM50148197
(1-[4-(4-Fluoro-phenoxy)-benzenesulfonylamino]-cycl...)
Show SMILES ONC(=O)C1(CC1)NS(=O)(=O)c1ccc(Oc2ccc(F)cc2)cc1
Show InChI InChI=1S/C16H15FN2O5S/c17-11-1-3-12(4-2-11)24-13-5-7-14(8-6-13)25(22,23)19-16(9-10-16)15(20)18-21/h1-8,19,21H,9-10H2,(H,18,20)
NCI pathway
Reactome pathway
n/an/a 0.930n/an/an/an/an/an/a
Pfizer Inc.
Curated by ChEMBL
Assay Description
Inhibitory activity against matrix metalloprotease-13 (MMP-13)
Bioorg Med Chem Lett 14: 3389-95 (2004)
Article DOI: 10.1016/j.bmcl.2004.04.083
BindingDB Entry DOI: 10.7270/Q25Q4WPN